{"text_format":"3","workbook":"xlsx","n_sheets":17,"sheets":["共通条件・結果","Ａ（北）","Ａ（北東）","Ａ（東）","Ａ（南東）","Ａ（南）","Ａ（南西）","Ａ（西）","Ａ（北西）","Ｂ（熱橋部）","Ｃ（屋根・床等）","D（基礎）","【付録】","外皮計算についてのQ&A","日射熱取得の考え方","熱橋の考え方 (H28年)","更新履歴"],"not_rendered":{"images":7,"external_links":1,"defined_names":37,"comments":9},"read":"whole","date_system":"1900"}

{"sheet":"共通条件・結果","index":0,"n_rows":30,"n_cols":44,"rows_kept":30,"merged":[[1,1,1,28],[2,1,2,28],[3,23,3,28],[4,32,4,33],[4,34,4,35],[4,36,4,37],[4,38,4,39],[4,40,4,41],[4,42,4,43],[5,1,5,8],[5,10,5,18],[5,19,5,21],[5,22,5,28],[6,1,6,8],[6,10,6,22],[6,23,6,25],[6,26,6,28],[10,1,10,8],[10,9,10,11],[10,12,10,13],[10,14,10,22],[10,23,10,26],[10,27,10,28],[11,1,11,8],[11,9,11,11],[11,12,11,13],[11,14,11,22],[11,23,11,26],[11,27,11,28],[15,1,15,8],[15,9,15,13],[15,14,15,18],[15,19,15,23],[15,26,15,28],[16,1,16,8],[16,9,16,11],[16,12,16,13],[16,14,16,16],[16,17,16,18],[16,19,16,23],[16,26,16,28],[17,1,17,8],[17,9,17,11],[17,14,17,16],[17,17,17,18],[17,19,17,23],[17,26,17,28],[18,26,18,28],[19,26,19,28],[20,26,20,28]]}
[]
[null,"住宅の外皮平均熱貫流率及び平均日射熱取得率（冷房期・暖房期）計算書 ",{"$nulls":31},"規約リンク"]
[null,"‐H28年省エネルギー基準に基づく（鉄筋コンクリート造等共同住宅）‐",{"$nulls":31},1]
[{"$nulls":22},"入力責任者：",{"$nulls":9},"外皮性能基準値"]
[null,"1）基本情報の入力",{"$nulls":30},"等級7",null,"等級6",null,"等級５",null,"等級４",null,"等級３",null,"等級２"]
[null,"　住宅の名称",{"$nulls":17},"住戸番号",{"$nulls":12},"ＵA","ηAC","ＵA","ηAC","ＵA","ηAC","ＵA","ηAC","ＵA","ηAC","ＵA","ηAC"]
[null,"　住宅の所在地",{"$nulls":21},"（地域区分）",null,null,"３地域",{"$nulls":4},"１地域",{"v":0.2,"d":"0.20"},"-",0.28,"-",{"v":0.4,"d":"0.40"},"-",0.46,"-",0.54,"-",0.72,"-"]
[{"$nulls":31},"２地域",{"v":0.2,"d":"0.20"},"-",0.28,"-",{"v":0.4,"d":"0.40"},"-",0.46,"-",0.54,"-",0.72,"-"]
[{"$nulls":31},"３地域",{"v":0.2,"d":"0.20"},"-",0.28,"-",{"v":0.5,"d":"0.50"},"-",0.56,"-",1.04,"-",1.21,"-"]
[null,"2）計算結果",{"$nulls":29},"４地域",0.23,"-",0.34,"-",{"v":0.6,"d":"0.60"},"-",0.75,"-",1.25,"-",1.47,"-"]
[null,"　外皮等面積の合計(ΣA)",{"$nulls":7},{"$f":"ROUND('Ａ（北）'!J45+'Ａ（北東）'!J45+'Ａ（東）'!J45+'Ａ（南東）'!J45+'Ａ（南）'!J45+'Ａ（南西）'!J45+'Ａ（西）'!J45+'Ａ（北西）'!J45+'Ｃ（屋根・床等）'!L32+'D（基礎）'!H15+'D（基礎）'!H45,2)","v":0},null,null,"㎡",null,"　冷房期の平均日射熱取得率(ηAC)",{"$nulls":8},{"$f":"IF(AH24=0,0,ROUNDUP(AI24,1))","v":0},{"$nulls":7},"５地域",0.26,{"v":3,"d":"3.0"},0.46,{"v":3,"d":"3.0"},{"v":0.6,"d":"0.60"},{"v":3,"d":"3.0"},0.87,{"v":3,"d":"3.0"},1.54,{"v":4,"d":"4.0"},1.67,"-"]
[null,"　外皮平均熱貫流率（UA）",{"$nulls":7},{"$f":"IF(AH23=0,0,ROUNDUP(AI23,2))","v":{"v":0,"d":"0.00"}},null,null,"W/（㎡K）",null,"　暖房期の平均日射熱取得率(ηAH)",{"$nulls":8},{"$f":"IF(AA7=\"８地域\",\"-\",IF(AH25=0,\"0\",ROUNDDOWN((AH25/J11)*100,1)))","v":"0"},{"$nulls":7},"６地域",0.26,2.8,0.46,2.8,{"v":0.6,"d":"0.60"},2.8,0.87,2.8,1.54,3.8,1.67,"-"]
[{"$nulls":31},"７地域",0.26,2.7,0.46,2.7,{"v":0.6,"d":"0.60"},2.7,0.87,2.7,1.81,{"v":4,"d":"4.0"},2.35,"-"]
[{"$nulls":31},"８地域","-","-","-",5.1,"-",6.7,"-",6.7,"-","-","-","-"]
[null,"3）省エネルギー基準外皮性能適合可否結果"]
[{"$nulls":9},"計算結果",{"$nulls":4},"基準値",{"$nulls":4},"判定",{"$nulls":6},"等級7",{"$nulls":5},"リンクセル"]
[null,"　外皮平均熱貫流率(UA)",{"$nulls":7},{"$f":"J12","v":{"v":0,"d":"0.00"}},null,null,"W/（㎡K）",null,{"$f":"IF(AA7<>\"\",VLOOKUP(AA7,AF7:AR14,2+(AG17-1)*2,FALSE),\"-\")","v":0.56},null,null,"W/（㎡K）",null,{"$f":"IF(O17=\"-\",\"-\",(IF(O17>=AI23,\"適合\",\"不適合\")))","v":"適合"},{"$nulls":6},"等級6",{"$nulls":5},4]
[null,"　冷房期の平均日射熱取得率(ηAC)",{"$nulls":7},{"$f":"X11","v":0},{"$nulls":4},{"$f":"IF(AA7<>\"\",VLOOKUP(AA7,AF7:AR14,3+(AG17-1)*2,FALSE),\"-\")","v":"-"},{"$nulls":4},{"$f":"IF(O18=\"-\",\"-\",(IF(O18>=AI24,\"適合\",\"不適合\")))","v":"-"},{"$nulls":6},"等級5\n(誘導基準相当)"]
[{"$nulls":26},"等級4\n(省エネ基準相当)",{"$nulls":5},"選択地域区分による基準値"]
[{"$nulls":26},"等級3",{"$nulls":5},{"$f":"VLOOKUP(AA7,$AF$7:$AR$14,2,FALSE)","v":{"v":0.2,"d":"0.20"}},{"$f":"VLOOKUP(AA7,$AF$7:$AR$14,3,FALSE)","v":"-"},{"$f":"VLOOKUP(AA7,$AF$7:$AN$14,4,FALSE)","v":0.28},{"$f":"VLOOKUP(AA7,$AF$7:$AR$14,5,FALSE)","v":"-"},{"$f":"VLOOKUP(AA7,$AF$7:$AR$14,6,FALSE)","v":{"v":0.5,"d":"0.50"}},{"$f":"VLOOKUP(AA7,$AF$7:$AR$14,7,FALSE)","v":"-"},{"$f":"VLOOKUP(AA7,$AF$7:$AR$14,8,FALSE)","v":0.56},{"$f":"VLOOKUP(AA7,$AF$7:$AR$14,9,FALSE)","v":"-"},{"$f":"VLOOKUP(AA7,$AF$7:$AR$14,10,FALSE)","v":1.04},{"$f":"VLOOKUP(AA7,$AF$7:$AR$14,11,FALSE)","v":"-"},{"$f":"VLOOKUP(AA7,$AF$7:$AR$14,12,FALSE)","v":1.21},{"$f":"VLOOKUP(AA7,$AF$7:$AR$14,13,FALSE)","v":"-"}]
[{"$nulls":26},"等級２"]
[{"$nulls":32},"小計（端数処理なし）"]
[null,null,"　注１：本計算シートに入力している面積は、別途平面図や立面図等で計算過程を明示しています。",{"$nulls":29},"q",{"$f":"'Ａ（北）'!AA48+'Ａ（北東）'!AA48+'Ａ（東）'!AA48+'Ａ（南東）'!AA48+'Ａ（南）'!AA48+'Ａ（南西）'!AA48+'Ａ（西）'!AA48+'Ａ（北西）'!AA48+'Ｂ（熱橋部）'!AC41+'Ｃ（屋根・床等）'!U35+'D（基礎）'!Q30+'D（基礎）'!W45","v":0},{"$f":"IF(AH23=0,0,AH23/J11)","v":0}]
[null,null,"　注２：本計算シートに入力している部位の熱貫流率は、別途計算書等を添付しています。",{"$nulls":29},"mc",{"$f":"'Ａ（北）'!AA46+'Ａ（北東）'!AA46+'Ａ（東）'!AA46+'Ａ（南東）'!AA46+'Ａ（南）'!AA46+'Ａ（南西）'!AA46+'Ａ（西）'!AA46+'Ａ（北西）'!AA46+'Ｂ（熱橋部）'!AC39+'Ｃ（屋根・床等）'!U33+'D（基礎）'!Q45","v":0},{"$f":"IF(AH24=0,0,(AH24/J11)*100)","v":0}]
[null,null,"　注３：本計算シートの計算方法は、（国研）建築研究所が示す外皮性能の計算方法を原則遵守しています。",{"$nulls":29},"mh",{"$f":"'Ａ（北）'!AA47+'Ａ（北東）'!AA47+'Ａ（東）'!AA47+'Ａ（南東）'!AA47+'Ａ（南）'!AA47+'Ａ（南西）'!AA47+'Ａ（西）'!AA47+'Ａ（北西）'!AA47+'Ｂ（熱橋部）'!AC40+'Ｃ（屋根・床等）'!U34+'D（基礎）'!T45","v":0}]
[null,null,"　注４：内訳計算シートＡは、住宅の外壁の面する方位別のシートに入力してください。"]
[null,null,"　注５：各シートの",{"$nulls":3},"黄色",null," 部分に入力するか、あるいはドロップボックスから選択してください。"]
[null,null,"　注６：各シートに入力する寸法は、メートル単位で入力して下さい。"]
[null,null,"　注７：本計算シートでは計算式の誤削除を防止するため、シートを保護しています。"]
[null,null,"　※1　建具の仕様、ガラスの仕様および付属部材の組み合わせに応じた日射熱取得率を直接入力して下さい。"]

{"sheet":"Ａ（北）","index":1,"n_rows":48,"n_cols":46,"rows_kept":48,"merged":[[1,1,1,30],[3,21,3,24],[3,25,3,26],[3,27,3,28],[4,1,6,2],[4,3,4,6],[4,7,6,8],[4,9,4,12],[4,13,6,14],[4,15,6,16],[4,17,4,24],[4,25,6,26],[4,27,6,28],[4,29,6,30],[5,3,6,4],[5,5,6,6],[5,9,6,10],[5,11,6,12],[5,17,6,18],[5,19,5,24],[5,34,5,35],[5,38,5,39],[5,41,5,42],[5,44,5,45],[6,19,6,20],[6,21,6,22],[6,23,6,24],[7,1,7,2],[7,3,7,4],[7,5,7,6],[7,7,7,8],[7,9,7,10],[7,11,7,12],[7,13,7,14],[7,15,7,16],[7,17,7,18],[7,19,7,20],[7,21,7,22],[7,23,7,24],[7,25,7,26],[7,27,7,28],[7,29,7,30],[8,1,8,2],[8,3,8,4],[8,5,8,6],[8,7,8,8],[8,9,8,10],[8,11,8,12],[8,13,8,14],[8,15,8,16],[8,17,8,18],[8,19,8,20],[8,21,8,22],[8,23,8,24],[8,25,8,26],[8,27,8,28],[8,29,8,30],[9,1,9,2],[9,3,9,4],[9,5,9,6],[9,7,9,8],[9,9,9,10],[9,11,9,12],[9,13,9,14],[9,15,9,16],[9,17,9,18],[9,19,9,20],[9,21,9,22],[9,23,9,24],[9,25,9,26],[9,27,9,28],[9,29,9,30],[10,1,10,2],[10,3,10,4],[10,5,10,6],[10,7,10,8],[10,9,10,10],[10,11,10,12],[10,13,10,14],[10,15,10,16],[10,17,10,18],[10,19,10,20],[10,21,10,22],[10,23,10,24],[10,25,10,26],[10,27,10,28],[10,29,10,30],[11,1,11,2],[11,3,11,4],[11,5,11,6],[11,7,11,8],[11,9,11,10],[11,11,11,12],[11,13,11,14],[11,15,11,16],[11,17,11,18],[11,19,11,20],[11,21,11,22],[11,23,11,24],[11,25,11,26],[11,27,11,28],[11,29,11,30],[12,1,12,2],[12,3,12,4],[12,5,12,6],[12,7,12,8],[12,9,12,10],[12,11,12,12],[12,13,12,14],[12,15,12,16],[12,17,12,18],[12,19,12,20],[12,21,12,22],[12,23,12,24],[12,25,12,26],[12,27,12,28],[12,29,12,30],[13,1,13,2],[13,3,13,4],[13,5,13,6],[13,7,13,8],[13,9,13,10],[13,11,13,12],[13,13,13,14],[13,15,13,16],[13,17,13,18],[13,19,13,20],[13,21,13,22],[13,23,13,24],[13,25,13,26],[13,27,13,28],[13,29,13,30],[14,1,14,24],[14,25,14,26],[14,27,14,28],[14,29,14,30],[15,44,15,45],[17,11,19,12],[17,13,18,16],[17,17,19,18],[17,19,19,20],[17,21,19,22],[17,23,17,28],[17,29,19,30],[18,23,19,24],[18,25,19,26],[18,27,19,28],[18,34,18,35],[18,44,18,45],[19,13,19,14],[19,15,19,16],[20,11,20,12],[20,13,20,14],[20,15,20,16],[20,17,20,18],[20,19,20,20],[20,21,20,22],[20,23,20,24],[20,25,20,26],[20,27,20,28],[20,29,20,30],[21,11,21,12],[21,13,21,14],[21,15,21,16],[21,17,21,18],[21,19,21,20],[21,21,21,22],[21,23,21,24],[21,25,21,26],[21,27,21,28],[21,29,21,30],[22,11,22,24],[22,25,22,26],[22,27,22,28],[22,29,22,30],[25,11,27,12],[25,13,27,14],[25,15,27,16],[25,17,27,18],[25,19,27,20],[25,21,27,22],[25,23,25,28],[25,29,27,30],[26,23,27,24],[26,25,27,26],[26,27,27,28],[26,34,26,35],[28,11,28,12],[28,13,28,14],[28,15,28,16],[28,17,28,18],[28,19,28,20],[28,21,28,22],[28,23,28,24],[28,25,28,26],[28,27,28,28],[28,29,28,30],[29,11,29,12],[29,13,29,14],[29,15,29,16],[29,17,29,18],[29,19,29,20],[29,21,29,22],[29,23,29,24],[29,25,29,26],[29,27,29,28],[29,29,29,30],[30,11,30,12],[30,13,30,14],[30,15,30,16],[30,17,30,18],[30,19,30,20],[30,21,30,22],[30,23,30,24],[30,25,30,26],[30,27,30,28],[30,29,30,30],[31,11,31,12],[31,13,31,14],[31,15,31,16],[31,17,31,18],[31,19,31,20],[31,21,31,22],[31,23,31,24],[31,25,31,26],[31,27,31,28],[31,29,31,30],[32,11,32,12],[32,13,32,14],[32,15,32,16],[32,17,32,18],[32,19,32,20],[32,21,32,22],[32,23,32,24],[32,25,32,26],[32,27,32,28],[32,29,32,30],[33,11,33,24],[33,25,33,26],[33,27,33,28],[33,29,33,30],[36,11,38,12],[36,13,37,18],[36,19,38,22],[36,23,38,26],[36,27,38,30],[38,13,38,15],[38,16,38,18],[39,11,39,12],[39,13,39,15],[39,16,39,18],[39,19,39,22],[39,23,39,26],[39,27,39,30],[40,11,40,12],[40,13,40,15],[40,16,40,18],[40,19,40,22],[40,23,40,26],[40,27,40,30],[41,11,41,26],[41,27,41,30],[44,1,47,2],[44,3,44,8],[44,9,44,11],[44,14,44,15],[44,18,44,19],[44,22,44,23],[44,28,44,29],[45,3,45,8],[45,26,45,28],[45,29,45,30],[46,3,46,8],[46,26,46,28],[46,29,46,30],[47,3,47,8],[47,26,47,28]]}
[]
[null,"内訳計算シートＡ　　＜北面＞ の外皮熱損失量と日射熱取得量",{"$nulls":31},"規約"]
[{"$nulls":33},{"$f":"共通条件・結果!AH3","v":1}]
[null,"1）窓の入力",{"$nulls":19},"方位係数",{"$nulls":3},{"$f":"IF(共通条件・結果!AA7=\"８地域\",\"0.325\",IF(共通条件・結果!AA7=\"７地域\",0.307,IF(共通条件・結果!AA7=\"６地域\",0.341,IF(共通条件・結果!AA7=\"５地域\",0.373,IF(共通条件・結果!AA7=\"４地域\",0.322,IF(共通条件・結果!AA7=\"３地域\",0.335,IF(共通条件・結果!AA7=\"２地域\",0.341,IF(共通条件・結果!AA7=\"１地域\",0.329))))))))","v":0.335},null,{"$f":"IF(共通条件・結果!AA7=\"８地域\",\"-\",IF(共通条件・結果!AA7=\"７地域\",0.227,IF(共通条件・結果!AA7=\"６地域\",0.261,IF(共通条件・結果!AA7=\"５地域\",0.238,IF(共通条件・結果!AA7=\"４地域\",0.256,IF(共通条件・結果!AA7=\"３地域\",0.284,IF(共通条件・結果!AA7=\"２地域\",0.263,IF(共通条件・結果!AA7=\"１地域\",0.26))))))))","v":0.284}]
[null,"窓番号",null,"寸法[ｍ]",{"$nulls":3},"熱貫流率\n[W/(㎡･K)]",null,"日射熱取得",{"$nulls":3},"付属部材\nの有無",null,"温度差\n係数",null,"取得日射量補正係数の算出",{"$nulls":7},"冷房期\n日射熱\n取得量\n[W/(W/㎡)]",null,"暖房期\n日射熱\n取得量\n[W/(W/㎡)]",null,"熱損失\n[W/K]"]
[{"$nulls":3},"幅",null,"高さ",{"$nulls":3},"加算の\n必要性",null,"日射熱\n取得率\n※1",{"$nulls":5},"ﾃﾞﾌｫﾙﾄ\n値使用",null,"庇による補正計算[ｍ]",{"$nulls":14},"日射熱取得量",{"$nulls":3},"取得日射量補正係数",null,null,"取得日射量補正係数(FALSEの場合)",null,null,"補正熱貫流率"]
[{"$nulls":19},"Z",null,"ｙ1",null,"ｙ2",{"$nulls":9},"日射の有無","冷房期","暖房期",null,null,"冷房期","暖房期",null,"冷房期","暖房期",null,"Ui","⊿R"]
[{"$nulls":25},{"$f":"IF(D8=\"\",\"\",AI8)","v":""},null,{"$f":"IF(D8=\"\",\"\",IF(ISERROR(AJ8),\"-\",AJ8))","v":""},null,{"$f":"IF(D8=\"\",\"\",D8*F8*AS8*P8)","v":""},{"$nulls":3},true,{"$f":"IF(AH8=FALSE,\"0.0\",D8*F8*L8*$Z$4*AM8)","v":0},{"$f":"IF(AH8=FALSE,\"0.0\",D8*F8*L8*$AB$4*AN8)","v":0},null,true,{"$f":"IF(AL8=TRUE,\"0.93\",IF(ISERROR(AP8),\"エラー\",IF(AP8>0.93,\"0.93\",AP8)))","v":"0.93"},{"$f":"IF(AL8=TRUE,\"0.51\",IF(ISERROR(AQ8),\"エラー\",IF(AQ8>0.72,\"0.72\",AQ8)))","v":"0.51"},null,{"$f":"0.01*(16+24*(2*V8+X8)/T8)","v":{"$error":"#DIV/0!"}},{"$f":"0.01*(10+15*(2*V8+X8)/T8)","v":{"$error":"#DIV/0!"}},null,{"$f":"IF(AT8=\"FALSE\",H8,IF(N8=\"風除室\",1/((1/H8)+0.1),0.5*H8+0.5*(1/((1/H8)+AT8))))","v":0},{"$f":"IF(N8=\"\",\"FALSE\",IF(N8=\"雨戸\",0.1,IF(N8=\"ｼｬｯﾀｰ\",0.1,IF(N8=\"障子\",0.18,IF(N8=\"風除室\",0.1)))))","v":"FALSE"}]
[{"$nulls":25},"",null,"",null,"",{"$nulls":3},true,{"$f":"IF(AH9=FALSE,\"0.0\",D9*F9*L9*$Z$4*AM9)","v":0},0,null,true,{"$f":"IF(AL9=TRUE,\"0.93\",IF(ISERROR(AP9),\"エラー\",IF(AP9>0.93,\"0.93\",AP9)))","v":"0.93"},{"$f":"IF(AL9=TRUE,\"0.51\",IF(ISERROR(AQ9),\"エラー\",IF(AQ9>0.72,\"0.72\",AQ9)))","v":"0.51"},null,{"$error":"#DIV/0!"},{"$error":"#DIV/0!"},null,{"$f":"IF(AT9=\"FALSE\",H9,IF(N9=\"風除室\",1/((1/H9)+0.1),0.5*H9+0.5*(1/((1/H9)+AT9))))","v":0},"FALSE"]
[{"$nulls":25},{"$f":"IF(D10=\"\",\"\",AI10)","v":""},null,"",null,"",{"$nulls":3},true,{"$f":"IF(AH10=FALSE,\"0.0\",D10*F10*L10*$Z$4*AM10)","v":0},0,null,true,{"$f":"IF(AL10=TRUE,\"0.93\",IF(ISERROR(AP10),\"エラー\",IF(AP10>0.93,\"0.93\",AP10)))","v":"0.93"},"0.51",null,{"$f":"0.01*(16+24*(2*V10+X10)/T10)","v":{"$error":"#DIV/0!"}},{"$error":"#DIV/0!"},null,0,"FALSE"]
[{"$nulls":25},"",null,"",null,"",{"$nulls":3},true,0,0,null,true,"0.93","0.51",null,{"$f":"0.01*(16+24*(2*V11+X11)/T11)","v":{"$error":"#DIV/0!"}},{"$error":"#DIV/0!"},null,0,"FALSE"]
[{"$nulls":25},{"$f":"IF(D12=\"\",\"\",AI12)","v":""},null,{"$f":"IF(D12=\"\",\"\",IF(ISERROR(AJ12),\"-\",AJ12))","v":""},null,"",{"$nulls":3},true,{"$f":"IF(AH12=FALSE,\"0.0\",D12*F12*L12*$Z$4*AM12)","v":0},0,null,true,{"$f":"IF(AL12=TRUE,\"0.93\",IF(ISERROR(AP12),\"エラー\",IF(AP12>0.93,\"0.93\",AP12)))","v":"0.93"},"0.51",null,{"$f":"0.01*(16+24*(2*V12+X12)/T12)","v":{"$error":"#DIV/0!"}},{"$error":"#DIV/0!"},null,0,"FALSE"]
[{"$nulls":25},"",null,"",null,"",{"$nulls":3},true,0,0,null,true,"0.93","0.51",null,{"$error":"#DIV/0!"},{"$error":"#DIV/0!"},null,0,"FALSE"]
[{"$nulls":25},"",null,"",null,"",{"$nulls":3},true,0,0,null,true,"0.93","0.51",null,{"$error":"#DIV/0!"},{"$error":"#DIV/0!"},null,0,"FALSE"]
[null,"窓 ＜北面＞ 各値合計",{"$nulls":23},{"$f":"SUM(Z8:AA14)","v":{"v":0,"d":"0.00"}},null,{"$f":"IF(共通条件・結果!AA7=\"８地域\",\"-\",SUM(AB8:AC14))","v":{"v":0,"d":"0.00"}},null,{"$f":"SUM(AD8:AE14)","v":{"v":0,"d":"0.00"}}]
[]
[{"$nulls":11},"2）ドアの入力"]
[{"$nulls":11},"ドア番号",null,"寸法[ｍ]",{"$nulls":3},"熱貫流率\n[W/(㎡･K)]",null,"付属部材\nの有無",null,"温度差\n係数",null,"日射熱取得[W/(W/㎡)]",{"$nulls":5},"熱損失\n[W/K]"]
[{"$nulls":23},"加算の\n必要性",null,"冷房期\n日射熱\n取得量",null,"暖房期\n日射熱\n取得量",{"$nulls":6},"日射熱取得量",{"$nulls":9},"補正熱貫流率"]
[{"$nulls":13},"幅",null,"高さ",{"$nulls":17},"日射の有無","冷房期","暖房期",{"$nulls":8},"Ui","⊿R"]
[{"$nulls":25},{"$f":"IF(N21=\"\",\"\",AI21)","v":""},null,{"$f":"IF(N21=\"\",\"\",IF(ISERROR(AJ21),\"-\",AJ21))","v":""},null,{"$f":"IF(N21=\"\",\"\",N21*P21*AS21*V21)","v":""},{"$nulls":3},true,{"$f":"IF(AH21=FALSE,\"0.0\",IF(AH21=TRUE,N21*P21*R21*0.034*$Z$4,\"-\"))","v":0},{"$f":"IF(AH21=FALSE,\"0.0\",IF(ISERROR(N21*P21*R21*0.034*$AB$4),\"-\",N21*P21*R21*0.034*$AB$4))","v":0},{"$nulls":8},{"$f":"IF(AT21=\"FALSE\",R21,IF(T21=\"風除室\",1/((1/R21)+0.1),0.5*R21+0.5*(1/((1/R21)+AT21))))","v":0},{"$f":"IF(T21=\"\",\"FALSE\",IF(T21=\"雨戸\",0.1,IF(T21=\"ｼｬｯﾀｰ\",0.1,IF(T21=\"障子\",0.18,IF(T21=\"風除室\",0.1)))))","v":"FALSE"}]
[{"$nulls":25},{"$f":"IF(N22=\"\",\"\",AI22)","v":""},null,{"$f":"IF(N22=\"\",\"\",IF(ISERROR(AJ22),\"-\",AJ22))","v":""},null,{"$f":"IF(N22=\"\",\"\",N22*P22*AS22*V22)","v":""},{"$nulls":3},true,{"$f":"IF(AH22=FALSE,\"0.0\",IF(AH22=TRUE,N22*P22*R22*0.034*$Z$4,\"-\"))","v":0},{"$f":"IF(AH22=FALSE,\"0.0\",IF(ISERROR(N22*P22*R22*0.034*$AB$4),\"-\",N22*P22*R22*0.034*$AB$4))","v":0},{"$nulls":8},{"$f":"IF(AT22=\"FALSE\",R22,IF(T22=\"風除室\",1/((1/R22)+0.1),0.5*R22+0.5*(1/((1/R22)+AT22))))","v":0},{"$f":"IF(T22=\"\",\"FALSE\",IF(T22=\"雨戸\",0.1,IF(T22=\"ｼｬｯﾀｰ\",0.1,IF(T22=\"障子\",0.18,IF(T22=\"風除室\",0.1)))))","v":"FALSE"}]
[{"$nulls":11},"　ドア ＜北面＞ 各値合計",{"$nulls":13},{"$f":"SUM(Z21:AA22)","v":{"v":0,"d":"0.00"}},null,{"$f":"SUM(AB21:AC22)","v":{"v":0,"d":"0.00"}},null,{"$f":"SUM(AD21:AE22)","v":{"v":0,"d":"0.00"}}]
[]
[{"$nulls":11},"3）外壁・界壁等の入力"]
[{"$nulls":11},"仕様番号",null,"外壁\n面積\n[㎡]",null,"除外窓\n等面積\n[㎡]",null,"計算対象\n外壁面積[㎡]",null,"熱貫流率\n[W/(㎡･K)]",null,"温度差\n係数",null,"日射熱取得[W/(W/㎡)]",{"$nulls":5},"熱損失\n[W/K]"]
[{"$nulls":23},"加算の\n必要性",null,"冷房期\n日射熱\n取得量",null,"暖房期\n日射熱\n取得量",{"$nulls":6},"日射熱取得量"]
[{"$nulls":33},"日射の有無","冷房期","暖房期"]
[{"$nulls":17},{"$f":"IF(N29=\"\",\"\",N29-P29)","v":""},{"$nulls":7},{"$f":"IF(N29=\"\",\"\",AI29)","v":""},null,{"$f":"IF(N29=\"\",\"\",AJ29)","v":""},null,{"$f":"IF(N29=\"\",\"\",R29*T29*V29)","v":""},{"$nulls":3},true,{"$f":"IF(AH29=FALSE,\"0.0\",IF(AH29=TRUE,R29*T29*0.034*$Z$4,\"-\"))","v":{"$error":"#VALUE!"}},{"$f":"IF(AH29=FALSE,\"0.0\",IF(ISERROR(R29*T29*0.034*$AB$4),\"-\",R29*T29*0.034*$AB$4))","v":"-"}]
[{"$nulls":17},{"$f":"IF(N30=\"\",\"\",N30-P30)","v":""},{"$nulls":7},{"$f":"IF(N30=\"\",\"\",AI30)","v":""},null,{"$f":"IF(N30=\"\",\"\",AJ30)","v":""},null,{"$f":"IF(N30=\"\",\"\",R30*T30*V30)","v":""},{"$nulls":3},true,{"$f":"IF(AH30=FALSE,\"0.0\",IF(AH30=TRUE,R30*T30*0.034*$Z$4,\"-\"))","v":{"$error":"#VALUE!"}},{"$f":"IF(AH30=FALSE,\"0.0\",IF(ISERROR(R30*T30*0.034*$AB$4),\"-\",R30*T30*0.034*$AB$4))","v":"-"}]
[{"$nulls":17},{"$f":"IF(N31=\"\",\"\",N31-P31)","v":""},{"$nulls":7},{"$f":"IF(N31=\"\",\"\",AI31)","v":""},null,{"$f":"IF(N31=\"\",\"\",AJ31)","v":""},null,{"$f":"IF(N31=\"\",\"\",R31*T31*V31)","v":""},{"$nulls":3},true,{"$f":"IF(AH31=FALSE,\"0.0\",IF(AH31=TRUE,R31*T31*0.034*$Z$4,\"-\"))","v":{"$error":"#VALUE!"}},{"$f":"IF(AH31=FALSE,\"0.0\",IF(ISERROR(R31*T31*0.034*$AB$4),\"-\",R31*T31*0.034*$AB$4))","v":"-"}]
[{"$nulls":17},{"$f":"IF(N32=\"\",\"\",N32-P32)","v":""},{"$nulls":7},{"$f":"IF(N32=\"\",\"\",AI32)","v":""},null,{"$f":"IF(N32=\"\",\"\",AJ32)","v":""},null,{"$f":"IF(N32=\"\",\"\",R32*T32*V32)","v":""},{"$nulls":3},true,{"$f":"IF(AH32=FALSE,\"0.0\",IF(AH32=TRUE,R32*T32*0.034*$Z$4,\"-\"))","v":{"$error":"#VALUE!"}},{"$f":"IF(AH32=FALSE,\"0.0\",IF(ISERROR(R32*T32*0.034*$AB$4),\"-\",R32*T32*0.034*$AB$4))","v":"-"}]
[{"$nulls":17},{"$f":"IF(N33=\"\",\"\",N33-P33)","v":""},{"$nulls":7},{"$f":"IF(N33=\"\",\"\",AI33)","v":""},null,{"$f":"IF(N33=\"\",\"\",AJ33)","v":""},null,{"$f":"IF(N33=\"\",\"\",R33*T33*V33)","v":""},{"$nulls":3},true,{"$f":"IF(AH33=FALSE,\"0.0\",IF(AH33=TRUE,R33*T33*0.034*$Z$4,\"-\"))","v":{"$error":"#VALUE!"}},{"$f":"IF(AH33=FALSE,\"0.0\",IF(ISERROR(R33*T33*0.034*$AB$4),\"-\",R33*T33*0.034*$AB$4))","v":"-"}]
[{"$nulls":11},"外壁・界壁等 ＜北面＞ 各値合計",{"$nulls":13},{"$f":"SUM(Z29:AA33)","v":{"v":0,"d":"0.00"}},null,{"$f":"IF(共通条件・結果!AA7=\"８地域\",\"-\",SUM(AB29:AC33))","v":{"v":0,"d":"0.00"}},null,{"$f":"SUM(AD29:AE33)","v":{"v":0,"d":"0.00"}}]
[{"$nulls":11},"※基礎壁は、こちらに入力してください。"]
[{"$nulls":11},"4）隣接空間に通ずる開口部の入力"]
[{"$nulls":11},"開口部\n番号",null,"寸法[ｍ]",{"$nulls":5},"熱貫流率\n[W/(㎡･K)]",{"$nulls":3},"温度差\n係数",{"$nulls":3},"熱損失\n[W/K]"]
[]
[{"$nulls":13},"幅",null,null,"高さ"]
[{"$nulls":27},{"$f":"IF(N40=\"\",\"\",N40*Q40*T40*X40)","v":""}]
[{"$nulls":27},{"$f":"IF(N41=\"\",\"\",N41*Q41*T41*X41)","v":""}]
[{"$nulls":11},"隣接空間に通ずる開口部 ＜北面＞ 各値合計",{"$nulls":15},{"$f":"SUM(AB40:AB41)","v":{"v":0,"d":"0.00"}}]
[]
[null,"5）住宅 ＜北面＞ 計算結果"]
[null,"北面",null,"　外皮等面積（内訳）",{"$nulls":5},{"$f":"$O45+$S$45+$W$45+$AC$45","v":{"v":0,"d":"0.00"}},null,null,"㎡","（窓",{"$f":"$D$8*$F$8+$D$9*$F$9+$D$10*$F$10+$D$11*$F$11+$D$12*$F$12+$D$13*$F$13+$D$14*$F$14","v":0},null,"㎡、ドア",null,{"$f":"$N$21*$P$21+$N$22*$P$22","v":0},null,"㎡、外壁",null,{"$f":"SUM($R$29:$S$33)","v":0},null,"㎡、その他開口部",{"$nulls":3},{"$f":"$N$40*$Q$40+$N$41*$Q$41","v":0},null,"㎡）"]
[{"$nulls":3},"　冷房期総日射熱取得量",{"$nulls":22},{"$f":"$Z$15+$Z$23+$Z$34","v":{"v":0,"d":"0.00"}},null,null,"[W/(W/㎡)]"]
[{"$nulls":3},"　暖房期総日射熱取得量",{"$nulls":22},{"$f":"IF(共通条件・結果!AA7=\"８地域\",\"-\",$AB$15+$AB$23+$AB$34)","v":{"v":0,"d":"0.00"}},null,null,"[W/(W/㎡)]"]
[{"$nulls":3},"　総熱損失",{"$nulls":22},{"$f":"$AD$15+$AD$23+$AD$34+$AB$42","v":{"v":0,"d":"0.00"}},null,null,"W/K"]

{"sheet":"Ａ（北東）","index":2,"n_rows":48,"n_cols":46,"rows_kept":48,"merged":[[1,1,1,30],[3,21,3,24],[3,25,3,26],[3,27,3,28],[4,1,6,2],[4,3,4,6],[4,7,6,8],[4,9,4,12],[4,13,6,14],[4,15,6,16],[4,17,4,24],[4,25,6,26],[4,27,6,28],[4,29,6,30],[5,3,6,4],[5,5,6,6],[5,9,6,10],[5,11,6,12],[5,17,6,18],[5,19,5,24],[5,34,5,35],[5,38,5,39],[5,41,5,42],[5,44,5,45],[6,19,6,20],[6,21,6,22],[6,23,6,24],[7,1,7,2],[7,3,7,4],[7,5,7,6],[7,7,7,8],[7,9,7,10],[7,11,7,12],[7,13,7,14],[7,15,7,16],[7,17,7,18],[7,19,7,20],[7,21,7,22],[7,23,7,24],[7,25,7,26],[7,27,7,28],[7,29,7,30],[8,1,8,2],[8,3,8,4],[8,5,8,6],[8,7,8,8],[8,9,8,10],[8,11,8,12],[8,13,8,14],[8,15,8,16],[8,17,8,18],[8,19,8,20],[8,21,8,22],[8,23,8,24],[8,25,8,26],[8,27,8,28],[8,29,8,30],[9,1,9,2],[9,3,9,4],[9,5,9,6],[9,7,9,8],[9,9,9,10],[9,11,9,12],[9,13,9,14],[9,15,9,16],[9,17,9,18],[9,19,9,20],[9,21,9,22],[9,23,9,24],[9,25,9,26],[9,27,9,28],[9,29,9,30],[10,1,10,2],[10,3,10,4],[10,5,10,6],[10,7,10,8],[10,9,10,10],[10,11,10,12],[10,13,10,14],[10,15,10,16],[10,17,10,18],[10,19,10,20],[10,21,10,22],[10,23,10,24],[10,25,10,26],[10,27,10,28],[10,29,10,30],[11,1,11,2],[11,3,11,4],[11,5,11,6],[11,7,11,8],[11,9,11,10],[11,11,11,12],[11,13,11,14],[11,15,11,16],[11,17,11,18],[11,19,11,20],[11,21,11,22],[11,23,11,24],[11,25,11,26],[11,27,11,28],[11,29,11,30],[12,1,12,2],[12,3,12,4],[12,5,12,6],[12,7,12,8],[12,9,12,10],[12,11,12,12],[12,13,12,14],[12,15,12,16],[12,17,12,18],[12,19,12,20],[12,21,12,22],[12,23,12,24],[12,25,12,26],[12,27,12,28],[12,29,12,30],[13,1,13,2],[13,3,13,4],[13,5,13,6],[13,7,13,8],[13,9,13,10],[13,11,13,12],[13,13,13,14],[13,15,13,16],[13,17,13,18],[13,19,13,20],[13,21,13,22],[13,23,13,24],[13,25,13,26],[13,27,13,28],[13,29,13,30],[14,1,14,24],[14,25,14,26],[14,27,14,28],[14,29,14,30],[15,44,15,45],[17,11,19,12],[17,13,18,16],[17,17,19,18],[17,19,19,20],[17,21,19,22],[17,23,17,28],[17,29,19,30],[18,23,19,24],[18,25,19,26],[18,27,19,28],[18,34,18,35],[18,44,18,45],[19,13,19,14],[19,15,19,16],[20,11,20,12],[20,13,20,14],[20,15,20,16],[20,17,20,18],[20,19,20,20],[20,21,20,22],[20,23,20,24],[20,25,20,26],[20,27,20,28],[20,29,20,30],[21,11,21,12],[21,13,21,14],[21,15,21,16],[21,17,21,18],[21,19,21,20],[21,21,21,22],[21,23,21,24],[21,25,21,26],[21,27,21,28],[21,29,21,30],[22,11,22,24],[22,25,22,26],[22,27,22,28],[22,29,22,30],[25,11,27,12],[25,13,27,14],[25,15,27,16],[25,17,27,18],[25,19,27,20],[25,21,27,22],[25,23,25,28],[25,29,27,30],[26,23,27,24],[26,25,27,26],[26,27,27,28],[26,34,26,35],[28,11,28,12],[28,13,28,14],[28,15,28,16],[28,17,28,18],[28,19,28,20],[28,21,28,22],[28,23,28,24],[28,25,28,26],[28,27,28,28],[28,29,28,30],[29,11,29,12],[29,13,29,14],[29,15,29,16],[29,17,29,18],[29,19,29,20],[29,21,29,22],[29,23,29,24],[29,25,29,26],[29,27,29,28],[29,29,29,30],[30,11,30,12],[30,13,30,14],[30,15,30,16],[30,17,30,18],[30,19,30,20],[30,21,30,22],[30,23,30,24],[30,25,30,26],[30,27,30,28],[30,29,30,30],[31,11,31,12],[31,13,31,14],[31,15,31,16],[31,17,31,18],[31,19,31,20],[31,21,31,22],[31,23,31,24],[31,25,31,26],[31,27,31,28],[31,29,31,30],[32,11,32,12],[32,13,32,14],[32,15,32,16],[32,17,32,18],[32,19,32,20],[32,21,32,22],[32,23,32,24],[32,25,32,26],[32,27,32,28],[32,29,32,30],[33,11,33,24],[33,25,33,26],[33,27,33,28],[33,29,33,30],[36,11,38,12],[36,13,37,18],[36,19,38,22],[36,23,38,26],[36,27,38,30],[38,13,38,15],[38,16,38,18],[39,11,39,12],[39,13,39,15],[39,16,39,18],[39,19,39,22],[39,23,39,26],[39,27,39,30],[40,11,40,12],[40,13,40,15],[40,16,40,18],[40,19,40,22],[40,23,40,26],[40,27,40,30],[41,11,41,26],[41,27,41,30],[44,1,47,2],[44,9,44,11],[44,14,44,15],[44,18,44,19],[44,22,44,23],[44,28,44,29],[45,26,45,28],[45,29,45,30],[46,26,46,28],[46,29,46,30],[47,26,47,28]]}
[]
[null,"内訳計算シートＡ　　＜北東面＞ の外皮熱損失量と日射熱取得量",{"$nulls":31},"規約"]
[{"$nulls":33},{"$f":"共通条件・結果!AH3","v":1}]
[null,"1）窓の入力",{"$nulls":19},"方位係数",{"$nulls":3},{"$f":"IF(共通条件・結果!AA7=\"８地域\",\"0.414\",IF(共通条件・結果!AA7=\"７地域\",0.415,IF(共通条件・結果!AA7=\"６地域\",0.431,IF(共通条件・結果!AA7=\"５地域\",0.437,IF(共通条件・結果!AA7=\"４地域\",0.426,IF(共通条件・結果!AA7=\"３地域\",0.39,IF(共通条件・結果!AA7=\"２地域\",0.412,IF(共通条件・結果!AA7=\"１地域\",0.43))))))))","v":0.39},null,{"$f":"IF(共通条件・結果!AA7=\"８地域\",\"-\",IF(共通条件・結果!AA7=\"７地域\",0.281,IF(共通条件・結果!AA7=\"６地域\",0.325,IF(共通条件・結果!AA7=\"５地域\",0.31,IF(共通条件・結果!AA7=\"４地域\",0.33,IF(共通条件・結果!AA7=\"３地域\",0.348,IF(共通条件・結果!AA7=\"２地域\",0.341,IF(共通条件・結果!AA7=\"１地域\",0.333))))))))","v":0.348}]
[null,"窓番号",null,"寸法[ｍ]",{"$nulls":3},"熱貫流率\n[W/(㎡･K)]",null,"日射熱取得",{"$nulls":3},"付属部材\nの有無",null,"温度差\n係数",null,"取得日射量補正係数の算出",{"$nulls":7},"冷房期\n日射熱\n取得量\n[W/(W/㎡)]",null,"暖房期\n日射熱\n取得量\n[W/(W/㎡)]",null,"熱損失\n[W/K]"]
[{"$nulls":3},"幅",null,"高さ",{"$nulls":3},"加算の\n必要性",null,"日射熱\n取得率\n※1",{"$nulls":5},"ﾃﾞﾌｫﾙﾄ\n値使用",null,"庇による補正計算[ｍ]",{"$nulls":14},"日射熱取得量",{"$nulls":3},"取得日射量補正係数",null,null,"取得日射量補正係数(FALSEの場合)",null,null,"補正熱貫流率"]
[{"$nulls":19},"Z",null,"ｙ1",null,"ｙ2",{"$nulls":9},"日射の有無","冷房期","暖房期",null,null,"冷房期","暖房期",null,"冷房期","暖房期",null,"Ui","⊿R"]
[{"$nulls":25},{"$f":"IF(D8=\"\",\"\",AI8)","v":""},null,{"$f":"IF(D8=\"\",\"\",IF(ISERROR(AJ8),\"-\",AJ8))","v":""},null,{"$f":"IF(D8=\"\",\"\",D8*F8*AS8*P8)","v":""},{"$nulls":3},true,{"$f":"IF(AH8=FALSE,\"0.0\",D8*F8*L8*$Z$4*AM8)","v":0},{"$f":"IF(AH8=FALSE,\"0.0\",D8*F8*L8*$AB$4*AN8)","v":0},null,true,{"$f":"IF(AL8=TRUE,\"0.93\",IF(ISERROR(AP8),\"エラー\",IF(AP8>0.93,\"0.93\",AP8)))","v":"0.93"},{"$f":"IF(AL8=TRUE,\"0.51\",IF(ISERROR(AQ8),\"エラー\",IF(AQ8>0.72,\"0.72\",AQ8)))","v":"0.51"},null,{"$f":"0.01*(16+24*(2*V8+X8)/T8)","v":{"$error":"#DIV/0!"}},{"$f":"0.01*(10+15*(2*V8+X8)/T8)","v":{"$error":"#DIV/0!"}},null,{"$f":"IF(AT8=\"FALSE\",H8,IF(N8=\"風除室\",1/((1/H8)+0.1),0.5*H8+0.5*(1/((1/H8)+AT8))))","v":0},{"$f":"IF(N8=\"\",\"FALSE\",IF(N8=\"雨戸\",0.1,IF(N8=\"ｼｬｯﾀｰ\",0.1,IF(N8=\"障子\",0.18,IF(N8=\"風除室\",0.1)))))","v":"FALSE"}]
[{"$nulls":25},"",null,"",null,"",{"$nulls":3},true,0,0,null,true,{"$f":"IF(AL9=TRUE,\"0.93\",IF(ISERROR(AP9),\"エラー\",IF(AP9>0.93,\"0.93\",AP9)))","v":"0.93"},{"$f":"IF(AL9=TRUE,\"0.51\",IF(ISERROR(AQ9),\"エラー\",IF(AQ9>0.72,\"0.72\",AQ9)))","v":"0.51"},null,{"$error":"#DIV/0!"},{"$error":"#DIV/0!"},null,{"$f":"IF(AT9=\"FALSE\",H9,IF(N9=\"風除室\",1/((1/H9)+0.1),0.5*H9+0.5*(1/((1/H9)+AT9))))","v":0},"FALSE"]
[{"$nulls":25},"",null,"",null,"",{"$nulls":3},true,0,0,null,true,"0.93","0.51",null,{"$error":"#DIV/0!"},{"$error":"#DIV/0!"},null,0,"FALSE"]
[{"$nulls":25},"",null,"",null,"",{"$nulls":3},true,0,0,null,true,"0.93","0.51",null,{"$error":"#DIV/0!"},{"$error":"#DIV/0!"},null,0,"FALSE"]
[{"$nulls":25},"",null,"",null,"",{"$nulls":3},true,0,0,null,true,"0.93","0.51",null,{"$error":"#DIV/0!"},{"$error":"#DIV/0!"},null,0,"FALSE"]
[{"$nulls":25},"",null,"",null,"",{"$nulls":3},true,0,0,null,true,"0.93","0.51",null,{"$error":"#DIV/0!"},{"$error":"#DIV/0!"},null,0,"FALSE"]
[{"$nulls":25},"",null,"",null,"",{"$nulls":3},true,0,0,null,true,"0.93","0.51",null,{"$error":"#DIV/0!"},{"$error":"#DIV/0!"},null,0,"FALSE"]
[null,"窓 ＜北東面＞ 各値合計",{"$nulls":23},{"$f":"SUM(Z8:AA14)","v":{"v":0,"d":"0.00"}},null,{"$f":"IF(共通条件・結果!AA7=\"８地域\",\"-\",SUM(AB8:AC14))","v":{"v":0,"d":"0.00"}},null,{"$f":"SUM(AD8:AE14)","v":{"v":0,"d":"0.00"}}]
[]
[{"$nulls":11},"2）ドアの入力"]
[{"$nulls":11},"ドア番号",null,"寸法[ｍ]",{"$nulls":3},"熱貫流率\n[W/(㎡･K)]",null,"付属部材\nの有無",null,"温度差\n係数",null,"日射熱取得[W/(W/㎡)]",{"$nulls":5},"熱損失\n[W/K]"]
[{"$nulls":23},"加算の\n必要性",null,"冷房期\n日射熱\n取得量",null,"暖房期\n日射熱\n取得量",{"$nulls":6},"日射熱取得量",{"$nulls":9},"補正熱貫流率"]
[{"$nulls":13},"幅",null,"高さ",{"$nulls":17},"日射の有無","冷房期","暖房期",{"$nulls":8},"Ui","⊿R"]
[{"$nulls":25},{"$f":"IF(N21=\"\",\"\",AI21)","v":""},null,{"$f":"IF(N21=\"\",\"\",IF(ISERROR(AJ21),\"-\",AJ21))","v":""},null,{"$f":"IF(N21=\"\",\"\",N21*P21*AS21*V21)","v":""},{"$nulls":3},true,{"$f":"IF(AH21=FALSE,\"0.0\",IF(AH21=TRUE,N21*P21*R21*0.034*$Z$4,\"-\"))","v":0},{"$f":"IF(AH21=FALSE,\"0.0\",IF(ISERROR(N21*P21*R21*0.034*$AB$4),\"-\",N21*P21*R21*0.034*$AB$4))","v":0},{"$nulls":8},{"$f":"IF(AT21=\"FALSE\",R21,IF(T21=\"風除室\",1/((1/R21)+0.1),0.5*R21+0.5*(1/((1/R21)+AT21))))","v":0},{"$f":"IF(T21=\"\",\"FALSE\",IF(T21=\"雨戸\",0.1,IF(T21=\"ｼｬｯﾀｰ\",0.1,IF(T21=\"障子\",0.18,IF(T21=\"風除室\",0.1)))))","v":"FALSE"}]
[{"$nulls":25},{"$f":"IF(N22=\"\",\"\",AI22)","v":""},null,{"$f":"IF(N22=\"\",\"\",IF(ISERROR(AJ22),\"-\",AJ22))","v":""},null,{"$f":"IF(N22=\"\",\"\",N22*P22*AS22*V22)","v":""},{"$nulls":3},true,{"$f":"IF(AH22=FALSE,\"0.0\",IF(AH22=TRUE,N22*P22*R22*0.034*$Z$4,\"-\"))","v":0},{"$f":"IF(AH22=FALSE,\"0.0\",IF(ISERROR(N22*P22*R22*0.034*$AB$4),\"-\",N22*P22*R22*0.034*$AB$4))","v":0},{"$nulls":8},{"$f":"IF(AT22=\"FALSE\",R22,IF(T22=\"風除室\",1/((1/R22)+0.1),0.5*R22+0.5*(1/((1/R22)+AT22))))","v":0},{"$f":"IF(T22=\"\",\"FALSE\",IF(T22=\"雨戸\",0.1,IF(T22=\"ｼｬｯﾀｰ\",0.1,IF(T22=\"障子\",0.18,IF(T22=\"風除室\",0.1)))))","v":"FALSE"}]
[{"$nulls":11},"　ドア ＜北東面＞ 各値合計",{"$nulls":13},{"$f":"SUM(Z21:AA22)","v":{"v":0,"d":"0.00"}},null,{"$f":"SUM(AB21:AC22)","v":{"v":0,"d":"0.00"}},null,{"$f":"SUM(AD21:AE22)","v":{"v":0,"d":"0.00"}}]
[]
[{"$nulls":11},"3）外壁・界壁等の入力"]
[{"$nulls":11},"仕様番号",null,"外壁\n面積\n[㎡]",null,"除外窓\n等面積\n[㎡]",null,"計算対象\n外壁面積[㎡]",null,"熱貫流率\n[W/(㎡･K)]",null,"温度差\n係数",null,"日射熱取得[W/(W/㎡)]",{"$nulls":5},"熱損失\n[W/K]"]
[{"$nulls":23},"加算の\n必要性",null,"冷房期\n日射熱\n取得量",null,"暖房期\n日射熱\n取得量",{"$nulls":6},"日射熱取得量"]
[{"$nulls":33},"日射の有無","冷房期","暖房期"]
[{"$nulls":17},{"$f":"IF(N29=\"\",\"\",N29-P29)","v":""},{"$nulls":7},{"$f":"IF(N29=\"\",\"\",AI29)","v":""},null,{"$f":"IF(N29=\"\",\"\",AJ29)","v":""},null,{"$f":"IF(N29=\"\",\"\",R29*T29*V29)","v":""},{"$nulls":3},true,{"$f":"IF(AH29=FALSE,\"0.0\",IF(AH29=TRUE,R29*T29*0.034*$Z$4,\"-\"))","v":{"$error":"#VALUE!"}},{"$f":"IF(AH29=FALSE,\"0.0\",IF(ISERROR(R29*T29*0.034*$AB$4),\"-\",R29*T29*0.034*$AB$4))","v":"-"}]
[{"$nulls":17},{"$f":"IF(N30=\"\",\"\",N30-P30)","v":""},{"$nulls":7},{"$f":"IF(N30=\"\",\"\",AI30)","v":""},null,{"$f":"IF(N30=\"\",\"\",AJ30)","v":""},null,{"$f":"IF(N30=\"\",\"\",R30*T30*V30)","v":""},{"$nulls":3},true,{"$f":"IF(AH30=FALSE,\"0.0\",IF(AH30=TRUE,R30*T30*0.034*$Z$4,\"-\"))","v":{"$error":"#VALUE!"}},{"$f":"IF(AH30=FALSE,\"0.0\",IF(ISERROR(R30*T30*0.034*$AB$4),\"-\",R30*T30*0.034*$AB$4))","v":"-"}]
[{"$nulls":17},{"$f":"IF(N31=\"\",\"\",N31-P31)","v":""},{"$nulls":7},{"$f":"IF(N31=\"\",\"\",AI31)","v":""},null,{"$f":"IF(N31=\"\",\"\",AJ31)","v":""},null,{"$f":"IF(N31=\"\",\"\",R31*T31*V31)","v":""},{"$nulls":3},true,{"$f":"IF(AH31=FALSE,\"0.0\",IF(AH31=TRUE,R31*T31*0.034*$Z$4,\"-\"))","v":{"$error":"#VALUE!"}},{"$f":"IF(AH31=FALSE,\"0.0\",IF(ISERROR(R31*T31*0.034*$AB$4),\"-\",R31*T31*0.034*$AB$4))","v":"-"}]
[{"$nulls":17},{"$f":"IF(N32=\"\",\"\",N32-P32)","v":""},{"$nulls":7},{"$f":"IF(N32=\"\",\"\",AI32)","v":""},null,{"$f":"IF(N32=\"\",\"\",AJ32)","v":""},null,{"$f":"IF(N32=\"\",\"\",R32*T32*V32)","v":""},{"$nulls":3},true,{"$f":"IF(AH32=FALSE,\"0.0\",IF(AH32=TRUE,R32*T32*0.034*$Z$4,\"-\"))","v":{"$error":"#VALUE!"}},{"$f":"IF(AH32=FALSE,\"0.0\",IF(ISERROR(R32*T32*0.034*$AB$4),\"-\",R32*T32*0.034*$AB$4))","v":"-"}]
[{"$nulls":17},{"$f":"IF(N33=\"\",\"\",N33-P33)","v":""},{"$nulls":7},{"$f":"IF(N33=\"\",\"\",AI33)","v":""},null,{"$f":"IF(N33=\"\",\"\",AJ33)","v":""},null,{"$f":"IF(N33=\"\",\"\",R33*T33*V33)","v":""},{"$nulls":3},true,{"$f":"IF(AH33=FALSE,\"0.0\",IF(AH33=TRUE,R33*T33*0.034*$Z$4,\"-\"))","v":{"$error":"#VALUE!"}},{"$f":"IF(AH33=FALSE,\"0.0\",IF(ISERROR(R33*T33*0.034*$AB$4),\"-\",R33*T33*0.034*$AB$4))","v":"-"}]
[{"$nulls":11},"外壁・界壁等 ＜北東面＞ 各値合計",{"$nulls":13},{"$f":"SUM(Z29:AA33)","v":{"v":0,"d":"0.00"}},null,{"$f":"IF(共通条件・結果!AA7=\"８地域\",\"-\",SUM(AB29:AC33))","v":{"v":0,"d":"0.00"}},null,{"$f":"SUM(AD29:AE33)","v":{"v":0,"d":"0.00"}}]
[{"$nulls":11},"※基礎壁は、こちらに入力してください。"]
[{"$nulls":11},"4）隣接空間に通ずる開口部の入力"]
[{"$nulls":11},"開口部\n番号",null,"寸法[ｍ]",{"$nulls":5},"熱貫流率\n[W/(㎡･K)]",{"$nulls":3},"温度差\n係数",{"$nulls":3},"熱損失\n[W/K]"]
[]
[{"$nulls":13},"幅",null,null,"高さ"]
[{"$nulls":27},{"$f":"IF(N40=\"\",\"\",N40*Q40*T40*X40)","v":""}]
[{"$nulls":27},{"$f":"IF(N41=\"\",\"\",N41*Q41*T41*X41)","v":""}]
[{"$nulls":11},"隣接空間に通ずる開口部 ＜北東面＞ 各値合計",{"$nulls":15},{"$f":"SUM(AB40:AB41)","v":{"v":0,"d":"0.00"}}]
[]
[null,"5）住宅 ＜北東面＞ 計算結果"]
[null,"北東面",null,"　外皮等面積（内訳）",{"$nulls":5},{"$f":"$O45+$S$45+$W$45+$AC$45","v":{"v":0,"d":"0.00"}},null,null,"㎡","（窓",{"$f":"$D$8*$F$8+$D$9*$F$9+$D$10*$F$10+$D$11*$F$11+$D$12*$F$12+$D$13*$F$13+$D$14*$F$14","v":0},null,"㎡、ドア",null,{"$f":"$N$21*$P$21+$N$22*$P$22","v":0},null,"㎡、外壁",null,{"$f":"SUM($R$29:$S$33)","v":0},null,"㎡、その他開口部",{"$nulls":3},{"$f":"$N$40*$Q$40+$N$41*$Q$41","v":0},null,"㎡）"]
[{"$nulls":3},"　冷房期総日射熱取得量",{"$nulls":22},{"$f":"$Z$15+$Z$23+$Z$34","v":{"v":0,"d":"0.00"}},null,null,"[W/(W/㎡)]"]
[{"$nulls":3},"　暖房期総日射熱取得量",{"$nulls":22},{"$f":"IF(共通条件・結果!AA7=\"８地域\",\"-\",$AB$15+$AB$23+$AB$34)","v":{"v":0,"d":"0.00"}},null,null,"[W/(W/㎡)]"]
[{"$nulls":3},"　総熱損失",{"$nulls":22},{"$f":"$AD$15+$AD$23+$AD$34+$AB$42","v":{"v":0,"d":"0.00"}},null,null,"W/K"]

{"sheet":"Ａ（東）","index":3,"n_rows":48,"n_cols":46,"rows_kept":48,"merged":[[1,1,1,30],[3,21,3,24],[3,25,3,26],[3,27,3,28],[4,1,6,2],[4,3,4,6],[4,7,6,8],[4,9,4,12],[4,13,6,14],[4,15,6,16],[4,17,4,24],[4,25,6,26],[4,27,6,28],[4,29,6,30],[5,3,6,4],[5,5,6,6],[5,9,6,10],[5,11,6,12],[5,17,6,18],[5,19,5,24],[5,34,5,35],[5,38,5,39],[5,41,5,42],[5,44,5,45],[6,19,6,20],[6,21,6,22],[6,23,6,24],[7,1,7,2],[7,3,7,4],[7,5,7,6],[7,7,7,8],[7,9,7,10],[7,11,7,12],[7,13,7,14],[7,15,7,16],[7,17,7,18],[7,19,7,20],[7,21,7,22],[7,23,7,24],[7,25,7,26],[7,27,7,28],[7,29,7,30],[8,1,8,2],[8,3,8,4],[8,5,8,6],[8,7,8,8],[8,9,8,10],[8,11,8,12],[8,13,8,14],[8,15,8,16],[8,17,8,18],[8,19,8,20],[8,21,8,22],[8,23,8,24],[8,25,8,26],[8,27,8,28],[8,29,8,30],[9,1,9,2],[9,3,9,4],[9,5,9,6],[9,7,9,8],[9,9,9,10],[9,11,9,12],[9,13,9,14],[9,15,9,16],[9,17,9,18],[9,19,9,20],[9,21,9,22],[9,23,9,24],[9,25,9,26],[9,27,9,28],[9,29,9,30],[10,1,10,2],[10,3,10,4],[10,5,10,6],[10,7,10,8],[10,9,10,10],[10,11,10,12],[10,13,10,14],[10,15,10,16],[10,17,10,18],[10,19,10,20],[10,21,10,22],[10,23,10,24],[10,25,10,26],[10,27,10,28],[10,29,10,30],[11,1,11,2],[11,3,11,4],[11,5,11,6],[11,7,11,8],[11,9,11,10],[11,11,11,12],[11,13,11,14],[11,15,11,16],[11,17,11,18],[11,19,11,20],[11,21,11,22],[11,23,11,24],[11,25,11,26],[11,27,11,28],[11,29,11,30],[12,1,12,2],[12,3,12,4],[12,5,12,6],[12,7,12,8],[12,9,12,10],[12,11,12,12],[12,13,12,14],[12,15,12,16],[12,17,12,18],[12,19,12,20],[12,21,12,22],[12,23,12,24],[12,25,12,26],[12,27,12,28],[12,29,12,30],[13,1,13,2],[13,3,13,4],[13,5,13,6],[13,7,13,8],[13,9,13,10],[13,11,13,12],[13,13,13,14],[13,15,13,16],[13,17,13,18],[13,19,13,20],[13,21,13,22],[13,23,13,24],[13,25,13,26],[13,27,13,28],[13,29,13,30],[14,1,14,24],[14,25,14,26],[14,27,14,28],[14,29,14,30],[15,44,15,45],[17,11,19,12],[17,13,18,16],[17,17,19,18],[17,19,19,20],[17,21,19,22],[17,23,17,28],[17,29,19,30],[18,23,19,24],[18,25,19,26],[18,27,19,28],[18,34,18,35],[18,44,18,45],[19,13,19,14],[19,15,19,16],[20,11,20,12],[20,13,20,14],[20,15,20,16],[20,17,20,18],[20,19,20,20],[20,21,20,22],[20,23,20,24],[20,25,20,26],[20,27,20,28],[20,29,20,30],[21,11,21,12],[21,13,21,14],[21,15,21,16],[21,17,21,18],[21,19,21,20],[21,21,21,22],[21,23,21,24],[21,25,21,26],[21,27,21,28],[21,29,21,30],[22,11,22,24],[22,25,22,26],[22,27,22,28],[22,29,22,30],[25,11,27,12],[25,13,27,14],[25,15,27,16],[25,17,27,18],[25,19,27,20],[25,21,27,22],[25,23,25,28],[25,29,27,30],[26,23,27,24],[26,25,27,26],[26,27,27,28],[26,34,26,35],[28,11,28,12],[28,13,28,14],[28,15,28,16],[28,17,28,18],[28,19,28,20],[28,21,28,22],[28,23,28,24],[28,25,28,26],[28,27,28,28],[28,29,28,30],[29,11,29,12],[29,13,29,14],[29,15,29,16],[29,17,29,18],[29,19,29,20],[29,21,29,22],[29,23,29,24],[29,25,29,26],[29,27,29,28],[29,29,29,30],[30,11,30,12],[30,13,30,14],[30,15,30,16],[30,17,30,18],[30,19,30,20],[30,21,30,22],[30,23,30,24],[30,25,30,26],[30,27,30,28],[30,29,30,30],[31,11,31,12],[31,13,31,14],[31,15,31,16],[31,17,31,18],[31,19,31,20],[31,21,31,22],[31,23,31,24],[31,25,31,26],[31,27,31,28],[31,29,31,30],[32,11,32,12],[32,13,32,14],[32,15,32,16],[32,17,32,18],[32,19,32,20],[32,21,32,22],[32,23,32,24],[32,25,32,26],[32,27,32,28],[32,29,32,30],[33,11,33,24],[33,25,33,26],[33,27,33,28],[33,29,33,30],[36,11,38,12],[36,13,37,18],[36,19,38,22],[36,23,38,26],[36,27,38,30],[38,13,38,15],[38,16,38,18],[39,11,39,12],[39,13,39,15],[39,16,39,18],[39,19,39,22],[39,23,39,26],[39,27,39,30],[40,11,40,12],[40,13,40,15],[40,16,40,18],[40,19,40,22],[40,23,40,26],[40,27,40,30],[41,11,41,26],[41,27,41,30],[44,1,47,2],[44,9,44,11],[44,14,44,15],[44,18,44,19],[44,22,44,23],[44,28,44,29],[45,26,45,28],[45,29,45,30],[46,26,46,28],[46,29,46,30],[47,26,47,28]]}
[]
[null,"内訳計算シートＡ　　＜東面＞ の外皮熱損失量と日射熱取得量",{"$nulls":31},"規約"]
[{"$nulls":33},{"$f":"共通条件・結果!AH3","v":1}]
[null,"1）窓の入力",{"$nulls":19},"方位係数",{"$nulls":3},{"$f":"IF(共通条件・結果!AA7=\"８地域\",\"0.515\",IF(共通条件・結果!AA7=\"７地域\",0.509,IF(共通条件・結果!AA7=\"６地域\",0.512,IF(共通条件・結果!AA7=\"５地域\",0.5,IF(共通条件・結果!AA7=\"４地域\",0.518,IF(共通条件・結果!AA7=\"３地域\",0.468,IF(共通条件・結果!AA7=\"２地域\",0.503,IF(共通条件・結果!AA7=\"１地域\",0.545))))))))","v":0.468},null,{"$f":"IF(共通条件・結果!AA7=\"８地域\",\"-\",IF(共通条件・結果!AA7=\"７地域\",0.543,IF(共通条件・結果!AA7=\"６地域\",0.579,IF(共通条件・結果!AA7=\"５地域\",0.568,IF(共通条件・結果!AA7=\"４地域\",0.531,IF(共通条件・結果!AA7=\"３地域\",0.54,IF(共通条件・結果!AA7=\"２地域\",0.554,IF(共通条件・結果!AA7=\"１地域\",0.564))))))))","v":{"v":0.54,"d":"0.540"}}]
[null,"窓番号",null,"寸法[ｍ]",{"$nulls":3},"熱貫流率\n[W/(㎡･K)]",null,"日射熱取得",{"$nulls":3},"付属部材\nの有無",null,"温度差\n係数",null,"取得日射量補正係数の算出",{"$nulls":7},"冷房期\n日射熱\n取得量\n[W/(W/㎡)]",null,"暖房期\n日射熱\n取得量\n[W/(W/㎡)]",null,"熱損失\n[W/K]"]
[{"$nulls":3},"幅",null,"高さ",{"$nulls":3},"加算の\n必要性",null,"日射熱\n取得率\n※1",{"$nulls":5},"ﾃﾞﾌｫﾙﾄ\n値使用",null,"庇による補正計算[ｍ]",{"$nulls":14},"日射熱取得量",{"$nulls":3},"取得日射量補正係数",null,null,"取得日射量補正係数(FALSEの場合)",null,null,"補正熱貫流率"]
[{"$nulls":19},"Z",null,"ｙ1",null,"ｙ2",{"$nulls":9},"日射の有無","冷房期","暖房期",null,null,"冷房期","暖房期",null,"冷房期","暖房期",null,"Ui","⊿R"]
[{"$nulls":25},{"$f":"IF(D8=\"\",\"\",AI8)","v":""},null,{"$f":"IF(D8=\"\",\"\",IF(ISERROR(AJ8),\"-\",AJ8))","v":""},null,{"$f":"IF(D8=\"\",\"\",D8*F8*AS8*P8)","v":""},{"$nulls":3},true,{"$f":"IF(AH8=FALSE,\"0.0\",D8*F8*L8*$Z$4*AM8)","v":0},{"$f":"IF(AH8=FALSE,\"0.0\",D8*F8*L8*$AB$4*AN8)","v":0},null,true,{"$f":"IF(AL8=TRUE,\"0.93\",IF(ISERROR(AP8),\"エラー\",IF(AP8>0.93,\"0.93\",AP8)))","v":"0.93"},{"$f":"IF(AL8=TRUE,\"0.51\",IF(ISERROR(AQ8),\"エラー\",IF(AQ8>0.72,\"0.72\",AQ8)))","v":"0.51"},null,{"$f":"0.01*(16+24*(2*V8+X8)/T8)","v":{"$error":"#DIV/0!"}},{"$f":"0.01*(10+15*(2*V8+X8)/T8)","v":{"$error":"#DIV/0!"}},null,{"$f":"IF(AT8=\"FALSE\",H8,IF(N8=\"風除室\",1/((1/H8)+0.1),0.5*H8+0.5*(1/((1/H8)+AT8))))","v":0},{"$f":"IF(N8=\"\",\"FALSE\",IF(N8=\"雨戸\",0.1,IF(N8=\"ｼｬｯﾀｰ\",0.1,IF(N8=\"障子\",0.18,IF(N8=\"風除室\",0.1)))))","v":"FALSE"}]
[{"$nulls":25},"",null,"",null,"",{"$nulls":3},true,0,0,null,true,{"$f":"IF(AL9=TRUE,\"0.93\",IF(ISERROR(AP9),\"エラー\",IF(AP9>0.93,\"0.93\",AP9)))","v":"0.93"},{"$f":"IF(AL9=TRUE,\"0.51\",IF(ISERROR(AQ9),\"エラー\",IF(AQ9>0.72,\"0.72\",AQ9)))","v":"0.51"},null,{"$error":"#DIV/0!"},{"$error":"#DIV/0!"},null,{"$f":"IF(AT9=\"FALSE\",H9,IF(N9=\"風除室\",1/((1/H9)+0.1),0.5*H9+0.5*(1/((1/H9)+AT9))))","v":0},"FALSE"]
[{"$nulls":25},"",null,"",null,"",{"$nulls":3},true,0,0,null,true,"0.93","0.51",null,{"$error":"#DIV/0!"},{"$error":"#DIV/0!"},null,0,"FALSE"]
[{"$nulls":25},"",null,"",null,"",{"$nulls":3},true,0,0,null,true,"0.93","0.51",null,{"$error":"#DIV/0!"},{"$error":"#DIV/0!"},null,0,"FALSE"]
[{"$nulls":25},"",null,"",null,"",{"$nulls":3},true,0,0,null,true,"0.93","0.51",null,{"$error":"#DIV/0!"},{"$error":"#DIV/0!"},null,0,"FALSE"]
[{"$nulls":25},"",null,"",null,"",{"$nulls":3},true,0,0,null,true,"0.93","0.51",null,{"$error":"#DIV/0!"},{"$error":"#DIV/0!"},null,0,"FALSE"]
[{"$nulls":25},"",null,"",null,"",{"$nulls":3},true,0,0,null,true,"0.93","0.51",null,{"$error":"#DIV/0!"},{"$error":"#DIV/0!"},null,0,"FALSE"]
[null,"窓 ＜東面＞ 各値合計",{"$nulls":23},{"$f":"SUM(Z8:AA14)","v":{"v":0,"d":"0.00"}},null,{"$f":"IF(共通条件・結果!AA7=\"８地域\",\"-\",SUM(AB8:AC14))","v":{"v":0,"d":"0.00"}},null,{"$f":"SUM(AD8:AE14)","v":{"v":0,"d":"0.00"}}]
[]
[{"$nulls":11},"2）ドアの入力"]
[{"$nulls":11},"ドア番号",null,"寸法[ｍ]",{"$nulls":3},"熱貫流率\n[W/(㎡･K)]",null,"付属部材\nの有無",null,"温度差\n係数",null,"日射熱取得[W/(W/㎡)]",{"$nulls":5},"熱損失\n[W/K]"]
[{"$nulls":23},"加算の\n必要性",null,"冷房期\n日射熱\n取得量",null,"暖房期\n日射熱\n取得量",{"$nulls":6},"日射熱取得量",{"$nulls":9},"補正熱貫流率"]
[{"$nulls":13},"幅",null,"高さ",{"$nulls":17},"日射の有無","冷房期","暖房期",{"$nulls":8},"Ui","⊿R"]
[{"$nulls":25},{"$f":"IF(N21=\"\",\"\",AI21)","v":""},null,{"$f":"IF(N21=\"\",\"\",IF(ISERROR(AJ21),\"-\",AJ21))","v":""},null,{"$f":"IF(N21=\"\",\"\",N21*P21*AS21*V21)","v":""},{"$nulls":3},true,{"$f":"IF(AH21=FALSE,\"0.0\",IF(AH21=TRUE,N21*P21*R21*0.034*$Z$4,\"-\"))","v":0},{"$f":"IF(AH21=FALSE,\"0.0\",IF(ISERROR(N21*P21*R21*0.034*$AB$4),\"-\",N21*P21*R21*0.034*$AB$4))","v":0},{"$nulls":8},{"$f":"IF(AT21=\"FALSE\",R21,IF(T21=\"風除室\",1/((1/R21)+0.1),0.5*R21+0.5*(1/((1/R21)+AT21))))","v":0},{"$f":"IF(T21=\"\",\"FALSE\",IF(T21=\"雨戸\",0.1,IF(T21=\"ｼｬｯﾀｰ\",0.1,IF(T21=\"障子\",0.18,IF(T21=\"風除室\",0.1)))))","v":"FALSE"}]
[{"$nulls":25},{"$f":"IF(N22=\"\",\"\",AI22)","v":""},null,{"$f":"IF(N22=\"\",\"\",IF(ISERROR(AJ22),\"-\",AJ22))","v":""},null,{"$f":"IF(N22=\"\",\"\",N22*P22*AS22*V22)","v":""},{"$nulls":3},true,{"$f":"IF(AH22=FALSE,\"0.0\",IF(AH22=TRUE,N22*P22*R22*0.034*$Z$4,\"-\"))","v":0},{"$f":"IF(AH22=FALSE,\"0.0\",IF(ISERROR(N22*P22*R22*0.034*$AB$4),\"-\",N22*P22*R22*0.034*$AB$4))","v":0},{"$nulls":8},{"$f":"IF(AT22=\"FALSE\",R22,IF(T22=\"風除室\",1/((1/R22)+0.1),0.5*R22+0.5*(1/((1/R22)+AT22))))","v":0},{"$f":"IF(T22=\"\",\"FALSE\",IF(T22=\"雨戸\",0.1,IF(T22=\"ｼｬｯﾀｰ\",0.1,IF(T22=\"障子\",0.18,IF(T22=\"風除室\",0.1)))))","v":"FALSE"}]
[{"$nulls":11},"　ドア ＜東面＞ 各値合計",{"$nulls":13},{"$f":"SUM(Z21:AA22)","v":{"v":0,"d":"0.00"}},null,{"$f":"SUM(AB21:AC22)","v":{"v":0,"d":"0.00"}},null,{"$f":"SUM(AD21:AE22)","v":{"v":0,"d":"0.00"}}]
[]
[{"$nulls":11},"3）外壁・界壁等の入力"]
[{"$nulls":11},"仕様番号",null,"外壁\n面積\n[㎡]",null,"除外窓\n等面積\n[㎡]",null,"計算対象\n外壁面積[㎡]",null,"熱貫流率\n[W/(㎡･K)]",null,"温度差\n係数",null,"日射熱取得[W/(W/㎡)]",{"$nulls":5},"熱損失\n[W/K]"]
[{"$nulls":23},"加算の\n必要性",null,"冷房期\n日射熱\n取得量",null,"暖房期\n日射熱\n取得量",{"$nulls":6},"日射熱取得量"]
[{"$nulls":33},"日射の有無","冷房期","暖房期"]
[{"$nulls":17},{"$f":"IF(N29=\"\",\"\",N29-P29)","v":""},{"$nulls":7},{"$f":"IF(N29=\"\",\"\",AI29)","v":""},null,{"$f":"IF(N29=\"\",\"\",AJ29)","v":""},null,{"$f":"IF(N29=\"\",\"\",R29*T29*V29)","v":""},{"$nulls":3},true,{"$f":"IF(AH29=FALSE,\"0.0\",IF(AH29=TRUE,R29*T29*0.034*$Z$4,\"-\"))","v":{"$error":"#VALUE!"}},{"$f":"IF(AH29=FALSE,\"0.0\",IF(ISERROR(R29*T29*0.034*$AB$4),\"-\",R29*T29*0.034*$AB$4))","v":"-"}]
[{"$nulls":17},{"$f":"IF(N30=\"\",\"\",N30-P30)","v":""},{"$nulls":7},{"$f":"IF(N30=\"\",\"\",AI30)","v":""},null,{"$f":"IF(N30=\"\",\"\",AJ30)","v":""},null,{"$f":"IF(N30=\"\",\"\",R30*T30*V30)","v":""},{"$nulls":3},true,{"$f":"IF(AH30=FALSE,\"0.0\",IF(AH30=TRUE,R30*T30*0.034*$Z$4,\"-\"))","v":{"$error":"#VALUE!"}},{"$f":"IF(AH30=FALSE,\"0.0\",IF(ISERROR(R30*T30*0.034*$AB$4),\"-\",R30*T30*0.034*$AB$4))","v":"-"}]
[{"$nulls":17},{"$f":"IF(N31=\"\",\"\",N31-P31)","v":""},{"$nulls":7},{"$f":"IF(N31=\"\",\"\",AI31)","v":""},null,{"$f":"IF(N31=\"\",\"\",AJ31)","v":""},null,{"$f":"IF(N31=\"\",\"\",R31*T31*V31)","v":""},{"$nulls":3},true,{"$f":"IF(AH31=FALSE,\"0.0\",IF(AH31=TRUE,R31*T31*0.034*$Z$4,\"-\"))","v":{"$error":"#VALUE!"}},{"$f":"IF(AH31=FALSE,\"0.0\",IF(ISERROR(R31*T31*0.034*$AB$4),\"-\",R31*T31*0.034*$AB$4))","v":"-"}]
[{"$nulls":17},{"$f":"IF(N32=\"\",\"\",N32-P32)","v":""},{"$nulls":7},{"$f":"IF(N32=\"\",\"\",AI32)","v":""},null,{"$f":"IF(N32=\"\",\"\",AJ32)","v":""},null,{"$f":"IF(N32=\"\",\"\",R32*T32*V32)","v":""},{"$nulls":3},true,{"$f":"IF(AH32=FALSE,\"0.0\",IF(AH32=TRUE,R32*T32*0.034*$Z$4,\"-\"))","v":{"$error":"#VALUE!"}},{"$f":"IF(AH32=FALSE,\"0.0\",IF(ISERROR(R32*T32*0.034*$AB$4),\"-\",R32*T32*0.034*$AB$4))","v":"-"}]
[{"$nulls":17},{"$f":"IF(N33=\"\",\"\",N33-P33)","v":""},{"$nulls":7},{"$f":"IF(N33=\"\",\"\",AI33)","v":""},null,{"$f":"IF(N33=\"\",\"\",AJ33)","v":""},null,{"$f":"IF(N33=\"\",\"\",R33*T33*V33)","v":""},{"$nulls":3},true,{"$f":"IF(AH33=FALSE,\"0.0\",IF(AH33=TRUE,R33*T33*0.034*$Z$4,\"-\"))","v":{"$error":"#VALUE!"}},{"$f":"IF(AH33=FALSE,\"0.0\",IF(ISERROR(R33*T33*0.034*$AB$4),\"-\",R33*T33*0.034*$AB$4))","v":"-"}]
[{"$nulls":11},"外壁・界壁等 ＜東面＞ 各値合計",{"$nulls":13},{"$f":"SUM(Z29:AA33)","v":{"v":0,"d":"0.00"}},null,{"$f":"IF(共通条件・結果!AA7=\"８地域\",\"-\",SUM(AB29:AC33))","v":{"v":0,"d":"0.00"}},null,{"$f":"SUM(AD29:AE33)","v":{"v":0,"d":"0.00"}}]
[{"$nulls":11},"※基礎壁は、こちらに入力してください。"]
[{"$nulls":11},"4）隣接空間に通ずる開口部の入力"]
[{"$nulls":11},"開口部\n番号",null,"寸法[ｍ]",{"$nulls":5},"熱貫流率\n[W/(㎡･K)]",{"$nulls":3},"温度差\n係数",{"$nulls":3},"熱損失\n[W/K]"]
[]
[{"$nulls":13},"幅",null,null,"高さ"]
[{"$nulls":27},{"$f":"IF(N40=\"\",\"\",N40*Q40*T40*X40)","v":""}]
[{"$nulls":27},{"$f":"IF(N41=\"\",\"\",N41*Q41*T41*X41)","v":""}]
[{"$nulls":11},"隣接空間に通ずる開口部 ＜東面＞ 各値合計",{"$nulls":15},{"$f":"SUM(AB40:AB41)","v":{"v":0,"d":"0.00"}}]
[]
[null,"5）住宅 ＜東面＞ 計算結果"]
[null,"東面",null,"　外皮等面積（内訳）",{"$nulls":5},{"$f":"$O45+$S$45+$W$45+$AC$45","v":{"v":0,"d":"0.00"}},null,null,"㎡","（窓",{"$f":"$D$8*$F$8+$D$9*$F$9+$D$10*$F$10+$D$11*$F$11+$D$12*$F$12+$D$13*$F$13+$D$14*$F$14","v":0},null,"㎡、ドア",null,{"$f":"$N$21*$P$21+$N$22*$P$22","v":0},null,"㎡、外壁",null,{"$f":"SUM($R$29:$S$33)","v":0},null,"㎡、その他開口部",{"$nulls":3},{"$f":"$N$40*$Q$40+$N$41*$Q$41","v":0},null,"㎡）"]
[{"$nulls":3},"　冷房期総日射熱取得量",{"$nulls":22},{"$f":"$Z$15+$Z$23+$Z$34","v":{"v":0,"d":"0.00"}},null,null,"[W/(W/㎡)]"]
[{"$nulls":3},"　暖房期総日射熱取得量",{"$nulls":22},{"$f":"IF(共通条件・結果!AA7=\"８地域\",\"-\",$AB$15+$AB$23+$AB$34)","v":{"v":0,"d":"0.00"}},null,null,"[W/(W/㎡)]"]
[{"$nulls":3},"　総熱損失",{"$nulls":22},{"$f":"$AD$15+$AD$23+$AD$34+$AB$42","v":{"v":0,"d":"0.00"}},null,null,"W/K"]

{"sheet":"Ａ（南東）","index":4,"n_rows":48,"n_cols":46,"rows_kept":48,"merged":[[1,1,1,30],[3,21,3,24],[3,25,3,26],[3,27,3,28],[4,1,6,2],[4,3,4,6],[4,7,6,8],[4,9,4,12],[4,13,6,14],[4,15,6,16],[4,17,4,24],[4,25,6,26],[4,27,6,28],[4,29,6,30],[5,3,6,4],[5,5,6,6],[5,9,6,10],[5,11,6,12],[5,17,6,18],[5,19,5,24],[5,34,5,35],[5,38,5,39],[5,41,5,42],[5,44,5,45],[6,19,6,20],[6,21,6,22],[6,23,6,24],[7,1,7,2],[7,3,7,4],[7,5,7,6],[7,7,7,8],[7,9,7,10],[7,11,7,12],[7,13,7,14],[7,15,7,16],[7,17,7,18],[7,19,7,20],[7,21,7,22],[7,23,7,24],[7,25,7,26],[7,27,7,28],[7,29,7,30],[8,1,8,2],[8,3,8,4],[8,5,8,6],[8,7,8,8],[8,9,8,10],[8,11,8,12],[8,13,8,14],[8,15,8,16],[8,17,8,18],[8,19,8,20],[8,21,8,22],[8,23,8,24],[8,25,8,26],[8,27,8,28],[8,29,8,30],[9,1,9,2],[9,3,9,4],[9,5,9,6],[9,7,9,8],[9,9,9,10],[9,11,9,12],[9,13,9,14],[9,15,9,16],[9,17,9,18],[9,19,9,20],[9,21,9,22],[9,23,9,24],[9,25,9,26],[9,27,9,28],[9,29,9,30],[10,1,10,2],[10,3,10,4],[10,5,10,6],[10,7,10,8],[10,9,10,10],[10,11,10,12],[10,13,10,14],[10,15,10,16],[10,17,10,18],[10,19,10,20],[10,21,10,22],[10,23,10,24],[10,25,10,26],[10,27,10,28],[10,29,10,30],[11,1,11,2],[11,3,11,4],[11,5,11,6],[11,7,11,8],[11,9,11,10],[11,11,11,12],[11,13,11,14],[11,15,11,16],[11,17,11,18],[11,19,11,20],[11,21,11,22],[11,23,11,24],[11,25,11,26],[11,27,11,28],[11,29,11,30],[12,1,12,2],[12,3,12,4],[12,5,12,6],[12,7,12,8],[12,9,12,10],[12,11,12,12],[12,13,12,14],[12,15,12,16],[12,17,12,18],[12,19,12,20],[12,21,12,22],[12,23,12,24],[12,25,12,26],[12,27,12,28],[12,29,12,30],[13,1,13,2],[13,3,13,4],[13,5,13,6],[13,7,13,8],[13,9,13,10],[13,11,13,12],[13,13,13,14],[13,15,13,16],[13,17,13,18],[13,19,13,20],[13,21,13,22],[13,23,13,24],[13,25,13,26],[13,27,13,28],[13,29,13,30],[14,1,14,24],[14,25,14,26],[14,27,14,28],[14,29,14,30],[15,44,15,45],[17,11,19,12],[17,13,18,16],[17,17,19,18],[17,19,19,20],[17,21,19,22],[17,23,17,28],[17,29,19,30],[18,23,19,24],[18,25,19,26],[18,27,19,28],[18,34,18,35],[18,44,18,45],[19,13,19,14],[19,15,19,16],[20,11,20,12],[20,13,20,14],[20,15,20,16],[20,17,20,18],[20,19,20,20],[20,21,20,22],[20,23,20,24],[20,25,20,26],[20,27,20,28],[20,29,20,30],[21,11,21,12],[21,13,21,14],[21,15,21,16],[21,17,21,18],[21,19,21,20],[21,21,21,22],[21,23,21,24],[21,25,21,26],[21,27,21,28],[21,29,21,30],[22,11,22,24],[22,25,22,26],[22,27,22,28],[22,29,22,30],[25,11,27,12],[25,13,27,14],[25,15,27,16],[25,17,27,18],[25,19,27,20],[25,21,27,22],[25,23,25,28],[25,29,27,30],[26,23,27,24],[26,25,27,26],[26,27,27,28],[26,34,26,35],[28,11,28,12],[28,13,28,14],[28,15,28,16],[28,17,28,18],[28,19,28,20],[28,21,28,22],[28,23,28,24],[28,25,28,26],[28,27,28,28],[28,29,28,30],[29,11,29,12],[29,13,29,14],[29,15,29,16],[29,17,29,18],[29,19,29,20],[29,21,29,22],[29,23,29,24],[29,25,29,26],[29,27,29,28],[29,29,29,30],[30,11,30,12],[30,13,30,14],[30,15,30,16],[30,17,30,18],[30,19,30,20],[30,21,30,22],[30,23,30,24],[30,25,30,26],[30,27,30,28],[30,29,30,30],[31,11,31,12],[31,13,31,14],[31,15,31,16],[31,17,31,18],[31,19,31,20],[31,21,31,22],[31,23,31,24],[31,25,31,26],[31,27,31,28],[31,29,31,30],[32,11,32,12],[32,13,32,14],[32,15,32,16],[32,17,32,18],[32,19,32,20],[32,21,32,22],[32,23,32,24],[32,25,32,26],[32,27,32,28],[32,29,32,30],[33,11,33,24],[33,25,33,26],[33,27,33,28],[33,29,33,30],[36,11,38,12],[36,13,37,18],[36,19,38,22],[36,23,38,26],[36,27,38,30],[38,13,38,15],[38,16,38,18],[39,11,39,12],[39,13,39,15],[39,16,39,18],[39,19,39,22],[39,23,39,26],[39,27,39,30],[40,11,40,12],[40,13,40,15],[40,16,40,18],[40,19,40,22],[40,23,40,26],[40,27,40,30],[41,11,41,26],[41,27,41,30],[44,1,47,2],[44,9,44,11],[44,14,44,15],[44,18,44,19],[44,22,44,23],[44,28,44,29],[45,26,45,28],[45,29,45,30],[46,26,46,28],[46,29,46,30],[47,26,47,28]]}
[]
[null,"内訳計算シートＡ　　＜南東面＞ の外皮熱損失量と日射熱取得量",{"$nulls":31},"規約"]
[{"$nulls":33},{"$f":"共通条件・結果!AH3","v":1}]
[null,"1）窓の入力",{"$nulls":19},"方位係数",{"$nulls":3},{"$f":"IF(共通条件・結果!AA7=\"８地域\",\"0.528\",IF(共通条件・結果!AA7=\"７地域\",0.49,IF(共通条件・結果!AA7=\"６地域\",0.498,IF(共通条件・結果!AA7=\"５地域\",0.5,IF(共通条件・結果!AA7=\"４地域\",0.508,IF(共通条件・結果!AA7=\"３地域\",0.487,IF(共通条件・結果!AA7=\"２地域\",0.527,IF(共通条件・結果!AA7=\"１地域\",0.56))))))))","v":0.487},null,{"$f":"IF(共通条件・結果!AA7=\"８地域\",\"-\",IF(共通条件・結果!AA7=\"７地域\",0.843,IF(共通条件・結果!AA7=\"６地域\",0.833,IF(共通条件・結果!AA7=\"５地域\",0.846,IF(共通条件・結果!AA7=\"４地域\",0.724,IF(共通条件・結果!AA7=\"３地域\",0.751,IF(共通条件・結果!AA7=\"２地域\",0.766,IF(共通条件・結果!AA7=\"１地域\",0.823))))))))","v":0.751}]
[null,"窓番号",null,"寸法[ｍ]",{"$nulls":3},"熱貫流率\n[W/(㎡･K)]",null,"日射熱取得",{"$nulls":3},"付属部材\nの有無",null,"温度差\n係数",null,"取得日射量補正係数の算出",{"$nulls":7},"冷房期\n日射熱\n取得量\n[W/(W/㎡)]",null,"暖房期\n日射熱\n取得量\n[W/(W/㎡)]",null,"熱損失\n[W/K]"]
[{"$nulls":3},"幅",null,"高さ",{"$nulls":3},"加算の\n必要性",null,"日射熱\n取得率\n※1",{"$nulls":5},"ﾃﾞﾌｫﾙﾄ\n値使用",null,"庇による補正計算[ｍ]",{"$nulls":14},"日射熱取得量",{"$nulls":3},"取得日射量補正係数",null,null,"取得日射量補正係数(FALSEの場合)",null,null,"補正熱貫流率"]
[{"$nulls":19},"Z",null,"ｙ1",null,"ｙ2",{"$nulls":9},"日射の有無","冷房期","暖房期",null,null,"冷房期","暖房期",null,"冷房期","暖房期",null,"Ui","⊿R"]
[{"$nulls":25},{"$f":"IF(D8=\"\",\"\",AI8)","v":""},null,{"$f":"IF(D8=\"\",\"\",IF(ISERROR(AJ8),\"-\",AJ8))","v":""},null,{"$f":"IF(D8=\"\",\"\",D8*F8*AS8*P8)","v":""},{"$nulls":3},true,{"$f":"IF(AH8=FALSE,\"0.0\",D8*F8*L8*$Z$4*AM8)","v":0},{"$f":"IF(AH8=FALSE,\"0.0\",D8*F8*L8*$AB$4*AN8)","v":0},null,true,{"$f":"IF(AL8=TRUE,\"0.93\",IF(ISERROR(AP8),\"エラー\",IF(AP8>0.93,\"0.93\",AP8)))","v":"0.93"},{"$f":"IF(AL8=TRUE,\"0.51\",IF(ISERROR(AQ8),\"エラー\",IF(AQ8>0.72,\"0.72\",AQ8)))","v":"0.51"},null,{"$f":"IF(共通条件・結果!$AA$7=\"８地域\",0.01*(16+19*(2*V8+X8)/T8),0.01*(16+24*(2*V8+X8)/T8))","v":{"$error":"#DIV/0!"}},{"$f":"0.01*(5+20*(3*V8+X8)/T8)","v":{"$error":"#DIV/0!"}},null,{"$f":"IF(AT8=\"FALSE\",H8,IF(N8=\"風除室\",1/((1/H8)+0.1),0.5*H8+0.5*(1/((1/H8)+AT8))))","v":0},{"$f":"IF(N8=\"\",\"FALSE\",IF(N8=\"雨戸\",0.1,IF(N8=\"ｼｬｯﾀｰ\",0.1,IF(N8=\"障子\",0.18,IF(N8=\"風除室\",0.1)))))","v":"FALSE"}]
[{"$nulls":25},"",null,"",null,{"$f":"IF(D9=\"\",\"\",D9*F9*AS9*P9)","v":""},{"$nulls":3},true,0,0,null,true,{"$f":"IF(AL9=TRUE,\"0.93\",IF(ISERROR(AP9),\"エラー\",IF(AP9>0.93,\"0.93\",AP9)))","v":"0.93"},{"$f":"IF(AL9=TRUE,\"0.51\",IF(ISERROR(AQ9),\"エラー\",IF(AQ9>0.72,\"0.72\",AQ9)))","v":"0.51"},null,{"$f":"IF(共通条件・結果!$AA$7=\"８地域\",0.01*(16+19*(2*V9+X9)/T9),0.01*(16+24*(2*V9+X9)/T9))","v":{"$error":"#DIV/0!"}},{"$error":"#DIV/0!"},null,{"$f":"IF(AT9=\"FALSE\",H9,IF(N9=\"風除室\",1/((1/H9)+0.1),0.5*H9+0.5*(1/((1/H9)+AT9))))","v":0},"FALSE"]
[{"$nulls":25},"",null,"",null,"",{"$nulls":3},true,0,0,null,true,"0.93","0.51",null,{"$f":"IF(共通条件・結果!$AA$7=\"８地域\",0.01*(16+19*(2*V10+X10)/T10),0.01*(16+24*(2*V10+X10)/T10))","v":{"$error":"#DIV/0!"}},{"$error":"#DIV/0!"},null,{"$f":"IF(AT10=\"FALSE\",H10,IF(N10=\"風除室\",1/((1/H10)+0.1),0.5*H10+0.5*(1/((1/H10)+AT10))))","v":0},"FALSE"]
[{"$nulls":25},"",null,"",null,"",{"$nulls":3},true,0,0,null,true,"0.93","0.51",null,{"$f":"IF(共通条件・結果!$AA$7=\"８地域\",0.01*(16+19*(2*V11+X11)/T11),0.01*(16+24*(2*V11+X11)/T11))","v":{"$error":"#DIV/0!"}},{"$error":"#DIV/0!"},null,0,"FALSE"]
[{"$nulls":25},"",null,"",null,"",{"$nulls":3},true,0,0,null,true,"0.93","0.51",null,{"$f":"IF(共通条件・結果!$AA$7=\"８地域\",0.01*(16+19*(2*V12+X12)/T12),0.01*(16+24*(2*V12+X12)/T12))","v":{"$error":"#DIV/0!"}},{"$error":"#DIV/0!"},null,0,"FALSE"]
[{"$nulls":25},"",null,"",null,"",{"$nulls":3},true,0,0,null,true,"0.93","0.51",null,{"$f":"IF(共通条件・結果!$AA$7=\"８地域\",0.01*(16+19*(2*V13+X13)/T13),0.01*(16+24*(2*V13+X13)/T13))","v":{"$error":"#DIV/0!"}},{"$error":"#DIV/0!"},null,0,"FALSE"]
[{"$nulls":25},"",null,"",null,"",{"$nulls":3},true,0,0,null,true,"0.93","0.51",null,{"$f":"IF(共通条件・結果!$AA$7=\"８地域\",0.01*(16+19*(2*V14+X14)/T14),0.01*(16+24*(2*V14+X14)/T14))","v":{"$error":"#DIV/0!"}},{"$error":"#DIV/0!"},null,0,"FALSE"]
[null,"窓 ＜南東面＞ 各値合計",{"$nulls":23},{"$f":"SUM(Z8:AA14)","v":{"v":0,"d":"0.00"}},null,{"$f":"IF(共通条件・結果!AA7=\"８地域\",\"-\",SUM(AB8:AC14))","v":{"v":0,"d":"0.00"}},null,{"$f":"SUM(AD8:AE14)","v":{"v":0,"d":"0.00"}}]
[]
[{"$nulls":11},"2）ドアの入力"]
[{"$nulls":11},"ドア番号",null,"寸法[ｍ]",{"$nulls":3},"熱貫流率\n[W/(㎡･K)]",null,"付属部材\nの有無",null,"温度差\n係数",null,"日射熱取得[W/(W/㎡)]",{"$nulls":5},"熱損失\n[W/K]"]
[{"$nulls":23},"加算の\n必要性",null,"冷房期\n日射熱\n取得量",null,"暖房期\n日射熱\n取得量",{"$nulls":6},"日射熱取得量",{"$nulls":9},"補正熱貫流率"]
[{"$nulls":13},"幅",null,"高さ",{"$nulls":17},"日射の有無","冷房期","暖房期",{"$nulls":8},"Ui","⊿R"]
[{"$nulls":25},{"$f":"IF(N21=\"\",\"\",AI21)","v":""},null,{"$f":"IF(N21=\"\",\"\",IF(ISERROR(AJ21),\"-\",AJ21))","v":""},null,{"$f":"IF(N21=\"\",\"\",N21*P21*AS21*V21)","v":""},{"$nulls":3},true,{"$f":"IF(AH21=FALSE,\"0.0\",IF(AH21=TRUE,N21*P21*R21*0.034*$Z$4,\"-\"))","v":0},{"$f":"IF(AH21=FALSE,\"0.0\",IF(ISERROR(N21*P21*R21*0.034*$AB$4),\"-\",N21*P21*R21*0.034*$AB$4))","v":0},{"$nulls":8},{"$f":"IF(AT21=\"FALSE\",R21,IF(T21=\"風除室\",1/((1/R21)+0.1),0.5*R21+0.5*(1/((1/R21)+AT21))))","v":0},{"$f":"IF(T21=\"\",\"FALSE\",IF(T21=\"雨戸\",0.1,IF(T21=\"ｼｬｯﾀｰ\",0.1,IF(T21=\"障子\",0.18,IF(T21=\"風除室\",0.1)))))","v":"FALSE"}]
[{"$nulls":25},{"$f":"IF(N22=\"\",\"\",AI22)","v":""},null,{"$f":"IF(N22=\"\",\"\",IF(ISERROR(AJ22),\"-\",AJ22))","v":""},null,{"$f":"IF(N22=\"\",\"\",N22*P22*AS22*V22)","v":""},{"$nulls":3},true,{"$f":"IF(AH22=FALSE,\"0.0\",IF(AH22=TRUE,N22*P22*R22*0.034*$Z$4,\"-\"))","v":0},{"$f":"IF(AH22=FALSE,\"0.0\",IF(ISERROR(N22*P22*R22*0.034*$AB$4),\"-\",N22*P22*R22*0.034*$AB$4))","v":0},{"$nulls":8},{"$f":"IF(AT22=\"FALSE\",R22,IF(T22=\"風除室\",1/((1/R22)+0.1),0.5*R22+0.5*(1/((1/R22)+AT22))))","v":0},{"$f":"IF(T22=\"\",\"FALSE\",IF(T22=\"雨戸\",0.1,IF(T22=\"ｼｬｯﾀｰ\",0.1,IF(T22=\"障子\",0.18,IF(T22=\"風除室\",0.1)))))","v":"FALSE"}]
[{"$nulls":11},"　ドア ＜南東面＞ 各値合計",{"$nulls":13},{"$f":"SUM(Z21:AA22)","v":{"v":0,"d":"0.00"}},null,{"$f":"SUM(AB21:AC22)","v":{"v":0,"d":"0.00"}},null,{"$f":"SUM(AD21:AE22)","v":{"v":0,"d":"0.00"}}]
[]
[{"$nulls":11},"3）外壁・界壁等の入力"]
[{"$nulls":11},"仕様番号",null,"外壁\n面積\n[㎡]",null,"除外窓\n等面積\n[㎡]",null,"計算対象\n外壁面積[㎡]",null,"熱貫流率\n[W/(㎡･K)]",null,"温度差\n係数",null,"日射熱取得[W/(W/㎡)]",{"$nulls":5},"熱損失\n[W/K]"]
[{"$nulls":23},"加算の\n必要性",null,"冷房期\n日射熱\n取得量",null,"暖房期\n日射熱\n取得量",{"$nulls":6},"日射熱取得量"]
[{"$nulls":33},"日射の有無","冷房期","暖房期"]
[{"$nulls":17},{"$f":"IF(N29=\"\",\"\",N29-P29)","v":""},{"$nulls":7},{"$f":"IF(N29=\"\",\"\",AI29)","v":""},null,{"$f":"IF(N29=\"\",\"\",AJ29)","v":""},null,{"$f":"IF(N29=\"\",\"\",R29*T29*V29)","v":""},{"$nulls":3},true,{"$f":"IF(AH29=FALSE,\"0.0\",IF(AH29=TRUE,R29*T29*0.034*$Z$4,\"-\"))","v":{"$error":"#VALUE!"}},{"$f":"IF(AH29=FALSE,\"0.0\",IF(ISERROR(R29*T29*0.034*$AB$4),\"-\",R29*T29*0.034*$AB$4))","v":"-"}]
[{"$nulls":17},{"$f":"IF(N30=\"\",\"\",N30-P30)","v":""},{"$nulls":7},{"$f":"IF(N30=\"\",\"\",AI30)","v":""},null,{"$f":"IF(N30=\"\",\"\",AJ30)","v":""},null,{"$f":"IF(N30=\"\",\"\",R30*T30*V30)","v":""},{"$nulls":3},true,{"$f":"IF(AH30=FALSE,\"0.0\",IF(AH30=TRUE,R30*T30*0.034*$Z$4,\"-\"))","v":{"$error":"#VALUE!"}},{"$f":"IF(AH30=FALSE,\"0.0\",IF(ISERROR(R30*T30*0.034*$AB$4),\"-\",R30*T30*0.034*$AB$4))","v":"-"}]
[{"$nulls":17},{"$f":"IF(N31=\"\",\"\",N31-P31)","v":""},{"$nulls":7},{"$f":"IF(N31=\"\",\"\",AI31)","v":""},null,{"$f":"IF(N31=\"\",\"\",AJ31)","v":""},null,{"$f":"IF(N31=\"\",\"\",R31*T31*V31)","v":""},{"$nulls":3},true,{"$f":"IF(AH31=FALSE,\"0.0\",IF(AH31=TRUE,R31*T31*0.034*$Z$4,\"-\"))","v":{"$error":"#VALUE!"}},{"$f":"IF(AH31=FALSE,\"0.0\",IF(ISERROR(R31*T31*0.034*$AB$4),\"-\",R31*T31*0.034*$AB$4))","v":"-"}]
[{"$nulls":17},{"$f":"IF(N32=\"\",\"\",N32-P32)","v":""},{"$nulls":7},{"$f":"IF(N32=\"\",\"\",AI32)","v":""},null,{"$f":"IF(N32=\"\",\"\",AJ32)","v":""},null,{"$f":"IF(N32=\"\",\"\",R32*T32*V32)","v":""},{"$nulls":3},true,{"$f":"IF(AH32=FALSE,\"0.0\",IF(AH32=TRUE,R32*T32*0.034*$Z$4,\"-\"))","v":{"$error":"#VALUE!"}},{"$f":"IF(AH32=FALSE,\"0.0\",IF(ISERROR(R32*T32*0.034*$AB$4),\"-\",R32*T32*0.034*$AB$4))","v":"-"}]
[{"$nulls":17},{"$f":"IF(N33=\"\",\"\",N33-P33)","v":""},{"$nulls":7},{"$f":"IF(N33=\"\",\"\",AI33)","v":""},null,{"$f":"IF(N33=\"\",\"\",AJ33)","v":""},null,{"$f":"IF(N33=\"\",\"\",R33*T33*V33)","v":""},{"$nulls":3},true,{"$f":"IF(AH33=FALSE,\"0.0\",IF(AH33=TRUE,R33*T33*0.034*$Z$4,\"-\"))","v":{"$error":"#VALUE!"}},{"$f":"IF(AH33=FALSE,\"0.0\",IF(ISERROR(R33*T33*0.034*$AB$4),\"-\",R33*T33*0.034*$AB$4))","v":"-"}]
[{"$nulls":11},"外壁・界壁等 ＜南東面＞ 各値合計",{"$nulls":13},{"$f":"SUM(Z29:AA33)","v":{"v":0,"d":"0.00"}},null,{"$f":"IF(共通条件・結果!AA7=\"８地域\",\"-\",SUM(AB29:AC33))","v":{"v":0,"d":"0.00"}},null,{"$f":"SUM(AD29:AE33)","v":{"v":0,"d":"0.00"}}]
[{"$nulls":11},"※基礎壁は、こちらに入力してください。"]
[{"$nulls":11},"4）隣接空間に通ずる開口部の入力"]
[{"$nulls":11},"開口部\n番号",null,"寸法[ｍ]",{"$nulls":5},"熱貫流率\n[W/(㎡･K)]",{"$nulls":3},"温度差\n係数",{"$nulls":3},"熱損失\n[W/K]"]
[]
[{"$nulls":13},"幅",null,null,"高さ"]
[{"$nulls":27},{"$f":"IF(N40=\"\",\"\",N40*Q40*T40*X40)","v":""}]
[{"$nulls":27},{"$f":"IF(N41=\"\",\"\",N41*Q41*T41*X41)","v":""}]
[{"$nulls":11},"隣接空間に通ずる開口部 ＜南東面＞ 各値合計",{"$nulls":15},{"$f":"SUM(AB40:AB41)","v":{"v":0,"d":"0.00"}}]
[]
[null,"5）住宅 ＜南東面＞ 計算結果"]
[null,"南東面",null,"　外皮等面積（内訳）",{"$nulls":5},{"$f":"$O45+$S$45+$W$45+$AC$45","v":{"v":0,"d":"0.00"}},null,null,"㎡","（窓",{"$f":"$D$8*$F$8+$D$9*$F$9+$D$10*$F$10+$D$11*$F$11+$D$12*$F$12+$D$13*$F$13+$D$14*$F$14","v":0},null,"㎡、ドア",null,{"$f":"$N$21*$P$21+$N$22*$P$22","v":0},null,"㎡、外壁",null,{"$f":"SUM($R$29:$S$33)","v":0},null,"㎡、その他開口部",{"$nulls":3},{"$f":"$N$40*$Q$40+$N$41*$Q$41","v":0},null,"㎡）"]
[{"$nulls":3},"　冷房期総日射熱取得量",{"$nulls":22},{"$f":"$Z$15+$Z$23+$Z$34","v":{"v":0,"d":"0.00"}},null,null,"[W/(W/㎡)]"]
[{"$nulls":3},"　暖房期総日射熱取得量",{"$nulls":22},{"$f":"IF(共通条件・結果!AA7=\"８地域\",\"-\",$AB$15+$AB$23+$AB$34)","v":{"v":0,"d":"0.00"}},null,null,"[W/(W/㎡)]"]
[{"$nulls":3},"　総熱損失",{"$nulls":22},{"$f":"$AD$15+$AD$23+$AD$34+$AB$42","v":{"v":0,"d":"0.00"}},null,null,"W/K"]

{"sheet":"Ａ（南）","index":5,"n_rows":48,"n_cols":46,"rows_kept":48,"merged":[[1,1,1,30],[3,21,3,24],[3,25,3,26],[3,27,3,28],[4,1,6,2],[4,3,4,6],[4,7,6,8],[4,9,4,12],[4,13,6,14],[4,15,6,16],[4,17,4,24],[4,25,6,26],[4,27,6,28],[4,29,6,30],[5,3,6,4],[5,5,6,6],[5,9,6,10],[5,11,6,12],[5,17,6,18],[5,19,5,24],[5,34,5,35],[5,38,5,39],[5,41,5,42],[5,44,5,45],[6,19,6,20],[6,21,6,22],[6,23,6,24],[7,1,7,2],[7,3,7,4],[7,5,7,6],[7,7,7,8],[7,9,7,10],[7,11,7,12],[7,13,7,14],[7,15,7,16],[7,17,7,18],[7,19,7,20],[7,21,7,22],[7,23,7,24],[7,25,7,26],[7,27,7,28],[7,29,7,30],[8,1,8,2],[8,3,8,4],[8,5,8,6],[8,7,8,8],[8,9,8,10],[8,11,8,12],[8,13,8,14],[8,15,8,16],[8,17,8,18],[8,19,8,20],[8,21,8,22],[8,23,8,24],[8,25,8,26],[8,27,8,28],[8,29,8,30],[9,1,9,2],[9,3,9,4],[9,5,9,6],[9,7,9,8],[9,9,9,10],[9,11,9,12],[9,13,9,14],[9,15,9,16],[9,17,9,18],[9,19,9,20],[9,21,9,22],[9,23,9,24],[9,25,9,26],[9,27,9,28],[9,29,9,30],[10,1,10,2],[10,3,10,4],[10,5,10,6],[10,7,10,8],[10,9,10,10],[10,11,10,12],[10,13,10,14],[10,15,10,16],[10,17,10,18],[10,19,10,20],[10,21,10,22],[10,23,10,24],[10,25,10,26],[10,27,10,28],[10,29,10,30],[11,1,11,2],[11,3,11,4],[11,5,11,6],[11,7,11,8],[11,9,11,10],[11,11,11,12],[11,13,11,14],[11,15,11,16],[11,17,11,18],[11,19,11,20],[11,21,11,22],[11,23,11,24],[11,25,11,26],[11,27,11,28],[11,29,11,30],[12,1,12,2],[12,3,12,4],[12,5,12,6],[12,7,12,8],[12,9,12,10],[12,11,12,12],[12,13,12,14],[12,15,12,16],[12,17,12,18],[12,19,12,20],[12,21,12,22],[12,23,12,24],[12,25,12,26],[12,27,12,28],[12,29,12,30],[13,1,13,2],[13,3,13,4],[13,5,13,6],[13,7,13,8],[13,9,13,10],[13,11,13,12],[13,13,13,14],[13,15,13,16],[13,17,13,18],[13,19,13,20],[13,21,13,22],[13,23,13,24],[13,25,13,26],[13,27,13,28],[13,29,13,30],[14,1,14,24],[14,25,14,26],[14,27,14,28],[14,29,14,30],[15,44,15,45],[17,11,19,12],[17,13,18,16],[17,17,19,18],[17,19,19,20],[17,21,19,22],[17,23,17,28],[17,29,19,30],[18,23,19,24],[18,25,19,26],[18,27,19,28],[18,34,18,35],[18,44,18,45],[19,13,19,14],[19,15,19,16],[20,11,20,12],[20,13,20,14],[20,15,20,16],[20,17,20,18],[20,19,20,20],[20,21,20,22],[20,23,20,24],[20,25,20,26],[20,27,20,28],[20,29,20,30],[21,11,21,12],[21,13,21,14],[21,15,21,16],[21,17,21,18],[21,19,21,20],[21,21,21,22],[21,23,21,24],[21,25,21,26],[21,27,21,28],[21,29,21,30],[22,11,22,24],[22,25,22,26],[22,27,22,28],[22,29,22,30],[25,11,27,12],[25,13,27,14],[25,15,27,16],[25,17,27,18],[25,19,27,20],[25,21,27,22],[25,23,25,28],[25,29,27,30],[26,23,27,24],[26,25,27,26],[26,27,27,28],[26,34,26,35],[28,11,28,12],[28,13,28,14],[28,15,28,16],[28,17,28,18],[28,19,28,20],[28,21,28,22],[28,23,28,24],[28,25,28,26],[28,27,28,28],[28,29,28,30],[29,11,29,12],[29,13,29,14],[29,15,29,16],[29,17,29,18],[29,19,29,20],[29,21,29,22],[29,23,29,24],[29,25,29,26],[29,27,29,28],[29,29,29,30],[30,11,30,12],[30,13,30,14],[30,15,30,16],[30,17,30,18],[30,19,30,20],[30,21,30,22],[30,23,30,24],[30,25,30,26],[30,27,30,28],[30,29,30,30],[31,11,31,12],[31,13,31,14],[31,15,31,16],[31,17,31,18],[31,19,31,20],[31,21,31,22],[31,23,31,24],[31,25,31,26],[31,27,31,28],[31,29,31,30],[32,11,32,12],[32,13,32,14],[32,15,32,16],[32,17,32,18],[32,19,32,20],[32,21,32,22],[32,23,32,24],[32,25,32,26],[32,27,32,28],[32,29,32,30],[33,11,33,24],[33,25,33,26],[33,27,33,28],[33,29,33,30],[36,11,38,12],[36,13,37,18],[36,19,38,22],[36,23,38,26],[36,27,38,30],[38,13,38,15],[38,16,38,18],[39,11,39,12],[39,13,39,15],[39,16,39,18],[39,19,39,22],[39,23,39,26],[39,27,39,30],[40,11,40,12],[40,13,40,15],[40,16,40,18],[40,19,40,22],[40,23,40,26],[40,27,40,30],[41,11,41,26],[41,27,41,30],[44,1,47,2],[44,9,44,11],[44,14,44,15],[44,18,44,19],[44,22,44,23],[44,28,44,29],[45,26,45,28],[45,29,45,30],[46,26,46,28],[46,29,46,30],[47,26,47,28]]}
[]
[null,"内訳計算シートＡ　　＜南面＞ の外皮熱損失量と日射熱取得量",{"$nulls":31},"規約"]
[{"$nulls":33},{"$f":"共通条件・結果!AH3","v":1}]
[null,"1）窓の入力",{"$nulls":19},"方位係数",{"$nulls":3},{"$f":"IF(共通条件・結果!AA7=\"８地域\",\"0.480\",IF(共通条件・結果!AA7=\"７地域\",0.412,IF(共通条件・結果!AA7=\"６地域\",0.434,IF(共通条件・結果!AA7=\"５地域\",0.472,IF(共通条件・結果!AA7=\"４地域\",0.437,IF(共通条件・結果!AA7=\"３地域\",0.476,IF(共通条件・結果!AA7=\"２地域\",0.507,IF(共通条件・結果!AA7=\"１地域\",0.502))))))))","v":0.476},null,{"$f":"IF(共通条件・結果!AA7=\"８地域\",\"-\",IF(共通条件・結果!AA7=\"７地域\",1.023,IF(共通条件・結果!AA7=\"６地域\",0.936,IF(共通条件・結果!AA7=\"５地域\",0.983,IF(共通条件・結果!AA7=\"４地域\",0.815,IF(共通条件・結果!AA7=\"３地域\",0.851,IF(共通条件・結果!AA7=\"２地域\",0.856,IF(共通条件・結果!AA7=\"１地域\",0.935))))))))","v":0.851}]
[null,"窓番号",null,"寸法[ｍ]",{"$nulls":3},"熱貫流率\n[W/(㎡･K)]",null,"日射熱取得",{"$nulls":3},"付属部材\nの有無",null,"温度差\n係数",null,"取得日射量補正係数の算出",{"$nulls":7},"冷房期\n日射熱\n取得量\n[W/(W/㎡)]",null,"暖房期\n日射熱\n取得量\n[W/(W/㎡)]",null,"熱損失\n[W/K]"]
[{"$nulls":3},"幅",null,"高さ",{"$nulls":3},"加算の\n必要性",null,"日射熱\n取得率\n※1",{"$nulls":5},"ﾃﾞﾌｫﾙﾄ\n値使用",null,"庇による補正計算[ｍ]",{"$nulls":14},"日射熱取得量",{"$nulls":3},"取得日射量補正係数",null,null,"取得日射量補正係数(FALSEの場合)",null,null,"補正熱貫流率"]
[{"$nulls":19},"Z",null,"ｙ1",null,"ｙ2",{"$nulls":9},"日射の有無","冷房期","暖房期",null,null,"冷房期","暖房期",null,"冷房期","暖房期",null,"Ui","⊿R"]
[{"$nulls":25},{"$f":"IF(D8=\"\",\"\",AI8)","v":""},null,{"$f":"IF(D8=\"\",\"\",IF(ISERROR(AJ8),\"-\",AJ8))","v":""},null,{"$f":"IF(D8=\"\",\"\",D8*F8*AS8*P8)","v":""},{"$nulls":3},true,{"$f":"IF(AH8=FALSE,\"0.0\",D8*F8*L8*$Z$4*AM8)","v":0},{"$f":"IF(AH8=FALSE,\"0.0\",D8*F8*L8*$AB$4*AN8)","v":0},null,true,{"$f":"IF(AL8=TRUE,\"0.93\",IF(ISERROR(AP8),\"エラー\",IF(AP8>0.93,\"0.93\",AP8)))","v":"0.93"},{"$f":"IF(AL8=TRUE,\"0.51\",IF(ISERROR(AQ8),\"エラー\",IF(AQ8>0.72,\"0.72\",AQ8)))","v":"0.51"},null,{"$f":"IF(共通条件・結果!$AA$7=\"８地域\",0.01*(16+19*(2*V8+X8)/T8),0.01*(24+9*(3*V8+X8)/T8))","v":{"$error":"#DIV/0!"}},{"$f":"0.01*(5+20*(3*V8+X8)/T8)","v":{"$error":"#DIV/0!"}},null,{"$f":"IF(AT8=\"FALSE\",H8,IF(N8=\"風除室\",1/((1/H8)+0.1),0.5*H8+0.5*(1/((1/H8)+AT8))))","v":0},{"$f":"IF(N8=\"\",\"FALSE\",IF(N8=\"雨戸\",0.1,IF(N8=\"ｼｬｯﾀｰ\",0.1,IF(N8=\"障子\",0.18,IF(N8=\"風除室\",0.1)))))","v":"FALSE"}]
[{"$nulls":25},"",null,"",null,"",{"$nulls":3},true,0,0,null,true,{"$f":"IF(AL9=TRUE,\"0.93\",IF(ISERROR(AP9),\"エラー\",IF(AP9>0.93,\"0.93\",AP9)))","v":"0.93"},{"$f":"IF(AL9=TRUE,\"0.51\",IF(ISERROR(AQ9),\"エラー\",IF(AQ9>0.72,\"0.72\",AQ9)))","v":"0.51"},null,{"$f":"IF(共通条件・結果!$AA$7=\"８地域\",0.01*(16+19*(2*V9+X9)/T9),0.01*(24+9*(3*V9+X9)/T9))","v":{"$error":"#DIV/0!"}},{"$error":"#DIV/0!"},null,{"$f":"IF(AT9=\"FALSE\",H9,IF(N9=\"風除室\",1/((1/H9)+0.1),0.5*H9+0.5*(1/((1/H9)+AT9))))","v":0},"FALSE"]
[{"$nulls":25},"",null,"",null,"",{"$nulls":3},true,0,0,null,true,"0.93","0.51",null,{"$f":"IF(共通条件・結果!$AA$7=\"８地域\",0.01*(16+19*(2*V10+X10)/T10),0.01*(24+9*(3*V10+X10)/T10))","v":{"$error":"#DIV/0!"}},{"$error":"#DIV/0!"},null,0,"FALSE"]
[{"$nulls":25},"",null,"",null,"",{"$nulls":3},true,0,0,null,true,"0.93","0.51",null,{"$f":"IF(共通条件・結果!$AA$7=\"８地域\",0.01*(16+19*(2*V11+X11)/T11),0.01*(24+9*(3*V11+X11)/T11))","v":{"$error":"#DIV/0!"}},{"$error":"#DIV/0!"},null,0,"FALSE"]
[{"$nulls":25},"",null,"",null,"",{"$nulls":3},true,0,0,null,true,"0.93","0.51",null,{"$f":"IF(共通条件・結果!$AA$7=\"８地域\",0.01*(16+19*(2*V12+X12)/T12),0.01*(24+9*(3*V12+X12)/T12))","v":{"$error":"#DIV/0!"}},{"$error":"#DIV/0!"},null,0,"FALSE"]
[{"$nulls":25},"",null,"",null,"",{"$nulls":3},true,0,0,null,true,"0.93","0.51",null,{"$f":"IF(共通条件・結果!$AA$7=\"８地域\",0.01*(16+19*(2*V13+X13)/T13),0.01*(24+9*(3*V13+X13)/T13))","v":{"$error":"#DIV/0!"}},{"$error":"#DIV/0!"},null,0,"FALSE"]
[{"$nulls":25},"",null,"",null,"",{"$nulls":3},true,0,0,null,true,"0.93","0.51",null,{"$f":"IF(共通条件・結果!$AA$7=\"８地域\",0.01*(16+19*(2*V14+X14)/T14),0.01*(24+9*(3*V14+X14)/T14))","v":{"$error":"#DIV/0!"}},{"$error":"#DIV/0!"},null,0,"FALSE"]
[null,"窓 ＜南面＞ 各値合計",{"$nulls":23},{"$f":"SUM(Z8:AA14)","v":{"v":0,"d":"0.00"}},null,{"$f":"IF(共通条件・結果!AA7=\"８地域\",\"-\",SUM(AB8:AC14))","v":{"v":0,"d":"0.00"}},null,{"$f":"SUM(AD8:AE14)","v":{"v":0,"d":"0.00"}}]
[]
[{"$nulls":11},"2）ドアの入力"]
[{"$nulls":11},"ドア番号",null,"寸法[ｍ]",{"$nulls":3},"熱貫流率\n[W/(㎡･K)]",null,"付属部材\nの有無",null,"温度差\n係数",null,"日射熱取得[W/(W/㎡)]",{"$nulls":5},"熱損失\n[W/K]"]
[{"$nulls":23},"加算の\n必要性",null,"冷房期\n日射熱\n取得量",null,"暖房期\n日射熱\n取得量",{"$nulls":6},"日射熱取得量",{"$nulls":9},"補正熱貫流率"]
[{"$nulls":13},"幅",null,"高さ",{"$nulls":17},"日射の有無","冷房期","暖房期",{"$nulls":8},"Ui","⊿R"]
[{"$nulls":25},{"$f":"IF(N21=\"\",\"\",AI21)","v":""},null,{"$f":"IF(N21=\"\",\"\",IF(ISERROR(AJ21),\"-\",AJ21))","v":""},null,{"$f":"IF(N21=\"\",\"\",N21*P21*AS21*V21)","v":""},{"$nulls":3},true,{"$f":"IF(AH21=FALSE,\"0.0\",IF(AH21=TRUE,N21*P21*R21*0.034*$Z$4,\"-\"))","v":0},{"$f":"IF(AH21=FALSE,\"0.0\",IF(ISERROR(N21*P21*R21*0.034*$AB$4),\"-\",N21*P21*R21*0.034*$AB$4))","v":0},{"$nulls":8},{"$f":"IF(AT21=\"FALSE\",R21,IF(T21=\"風除室\",1/((1/R21)+0.1),0.5*R21+0.5*(1/((1/R21)+AT21))))","v":0},{"$f":"IF(T21=\"\",\"FALSE\",IF(T21=\"雨戸\",0.1,IF(T21=\"ｼｬｯﾀｰ\",0.1,IF(T21=\"障子\",0.18,IF(T21=\"風除室\",0.1)))))","v":"FALSE"}]
[{"$nulls":25},{"$f":"IF(N22=\"\",\"\",AI22)","v":""},null,{"$f":"IF(N22=\"\",\"\",IF(ISERROR(AJ22),\"-\",AJ22))","v":""},null,{"$f":"IF(N22=\"\",\"\",N22*P22*AS22*V22)","v":""},{"$nulls":3},true,{"$f":"IF(AH22=FALSE,\"0.0\",IF(AH22=TRUE,N22*P22*R22*0.034*$Z$4,\"-\"))","v":0},{"$f":"IF(AH22=FALSE,\"0.0\",IF(ISERROR(N22*P22*R22*0.034*$AB$4),\"-\",N22*P22*R22*0.034*$AB$4))","v":0},{"$nulls":8},{"$f":"IF(AT22=\"FALSE\",R22,IF(T22=\"風除室\",1/((1/R22)+0.1),0.5*R22+0.5*(1/((1/R22)+AT22))))","v":0},{"$f":"IF(T22=\"\",\"FALSE\",IF(T22=\"雨戸\",0.1,IF(T22=\"ｼｬｯﾀｰ\",0.1,IF(T22=\"障子\",0.18,IF(T22=\"風除室\",0.1)))))","v":"FALSE"}]
[{"$nulls":11},"　ドア ＜南面＞ 各値合計",{"$nulls":13},{"$f":"SUM(Z21:AA22)","v":{"v":0,"d":"0.00"}},null,{"$f":"SUM(AB21:AC22)","v":{"v":0,"d":"0.00"}},null,{"$f":"SUM(AD21:AE22)","v":{"v":0,"d":"0.00"}}]
[]
[{"$nulls":11},"3）外壁・界壁等の入力"]
[{"$nulls":11},"仕様番号",null,"外壁\n面積\n[㎡]",null,"除外窓\n等面積\n[㎡]",null,"計算対象\n外壁面積[㎡]",null,"熱貫流率\n[W/(㎡･K)]",null,"温度差\n係数",null,"日射熱取得[W/(W/㎡)]",{"$nulls":5},"熱損失\n[W/K]"]
[{"$nulls":23},"加算の\n必要性",null,"冷房期\n日射熱\n取得量",null,"暖房期\n日射熱\n取得量",{"$nulls":6},"日射熱取得量"]
[{"$nulls":33},"日射の有無","冷房期","暖房期"]
[{"$nulls":17},{"$f":"IF(N29=\"\",\"\",N29-P29)","v":""},{"$nulls":7},{"$f":"IF(N29=\"\",\"\",AI29)","v":""},null,{"$f":"IF(N29=\"\",\"\",AJ29)","v":""},null,{"$f":"IF(N29=\"\",\"\",R29*T29*V29)","v":""},{"$nulls":3},true,{"$f":"IF(AH29=FALSE,\"0.0\",IF(AH29=TRUE,R29*T29*0.034*$Z$4,\"-\"))","v":{"$error":"#VALUE!"}},{"$f":"IF(AH29=FALSE,\"0.0\",IF(ISERROR(R29*T29*0.034*$AB$4),\"-\",R29*T29*0.034*$AB$4))","v":"-"}]
[{"$nulls":17},{"$f":"IF(N30=\"\",\"\",N30-P30)","v":""},{"$nulls":7},{"$f":"IF(N30=\"\",\"\",AI30)","v":""},null,{"$f":"IF(N30=\"\",\"\",AJ30)","v":""},null,{"$f":"IF(N30=\"\",\"\",R30*T30*V30)","v":""},{"$nulls":3},true,{"$f":"IF(AH30=FALSE,\"0.0\",IF(AH30=TRUE,R30*T30*0.034*$Z$4,\"-\"))","v":{"$error":"#VALUE!"}},{"$f":"IF(AH30=FALSE,\"0.0\",IF(ISERROR(R30*T30*0.034*$AB$4),\"-\",R30*T30*0.034*$AB$4))","v":"-"}]
[{"$nulls":17},{"$f":"IF(N31=\"\",\"\",N31-P31)","v":""},{"$nulls":7},{"$f":"IF(N31=\"\",\"\",AI31)","v":""},null,{"$f":"IF(N31=\"\",\"\",AJ31)","v":""},null,{"$f":"IF(N31=\"\",\"\",R31*T31*V31)","v":""},{"$nulls":3},true,{"$f":"IF(AH31=FALSE,\"0.0\",IF(AH31=TRUE,R31*T31*0.034*$Z$4,\"-\"))","v":{"$error":"#VALUE!"}},{"$f":"IF(AH31=FALSE,\"0.0\",IF(ISERROR(R31*T31*0.034*$AB$4),\"-\",R31*T31*0.034*$AB$4))","v":"-"}]
[{"$nulls":17},{"$f":"IF(N32=\"\",\"\",N32-P32)","v":""},{"$nulls":7},{"$f":"IF(N32=\"\",\"\",AI32)","v":""},null,{"$f":"IF(N32=\"\",\"\",AJ32)","v":""},null,{"$f":"IF(N32=\"\",\"\",R32*T32*V32)","v":""},{"$nulls":3},true,{"$f":"IF(AH32=FALSE,\"0.0\",IF(AH32=TRUE,R32*T32*0.034*$Z$4,\"-\"))","v":{"$error":"#VALUE!"}},{"$f":"IF(AH32=FALSE,\"0.0\",IF(ISERROR(R32*T32*0.034*$AB$4),\"-\",R32*T32*0.034*$AB$4))","v":"-"}]
[{"$nulls":17},{"$f":"IF(N33=\"\",\"\",N33-P33)","v":""},{"$nulls":7},{"$f":"IF(N33=\"\",\"\",AI33)","v":""},null,{"$f":"IF(N33=\"\",\"\",AJ33)","v":""},null,{"$f":"IF(N33=\"\",\"\",R33*T33*V33)","v":""},{"$nulls":3},true,{"$f":"IF(AH33=FALSE,\"0.0\",IF(AH33=TRUE,R33*T33*0.034*$Z$4,\"-\"))","v":{"$error":"#VALUE!"}},{"$f":"IF(AH33=FALSE,\"0.0\",IF(ISERROR(R33*T33*0.034*$AB$4),\"-\",R33*T33*0.034*$AB$4))","v":"-"}]
[{"$nulls":11},"外壁・界壁等 ＜南面＞ 各値合計",{"$nulls":13},{"$f":"SUM(Z29:AA33)","v":{"v":0,"d":"0.00"}},null,{"$f":"IF(共通条件・結果!AA7=\"８地域\",\"-\",SUM(AB29:AC33))","v":{"v":0,"d":"0.00"}},null,{"$f":"SUM(AD29:AE33)","v":{"v":0,"d":"0.00"}}]
[{"$nulls":11},"※基礎壁は、こちらに入力してください。"]
[{"$nulls":11},"4）隣接空間に通ずる開口部の入力"]
[{"$nulls":11},"開口部\n番号",null,"寸法[ｍ]",{"$nulls":5},"熱貫流率\n[W/(㎡･K)]",{"$nulls":3},"温度差\n係数",{"$nulls":3},"熱損失\n[W/K]"]
[]
[{"$nulls":13},"幅",null,null,"高さ"]
[{"$nulls":27},{"$f":"IF(N40=\"\",\"\",N40*Q40*T40*X40)","v":""}]
[{"$nulls":27},{"$f":"IF(N41=\"\",\"\",N41*Q41*T41*X41)","v":""}]
[{"$nulls":11},"隣接空間に通ずる開口部＜南面＞ 各値合計",{"$nulls":15},{"$f":"SUM(AB40:AB41)","v":{"v":0,"d":"0.00"}}]
[]
[null,"5）住宅 ＜南面＞ 計算結果"]
[null,"南面",null,"　外皮等面積（内訳）",{"$nulls":5},{"$f":"$O45+$S$45+$W$45+$AC$45","v":{"v":0,"d":"0.00"}},null,null,"㎡","（窓",{"$f":"$D$8*$F$8+$D$9*$F$9+$D$10*$F$10+$D$11*$F$11+$D$12*$F$12+$D$13*$F$13+$D$14*$F$14","v":0},null,"㎡、ドア",null,{"$f":"$N$21*$P$21+$N$22*$P$22","v":0},null,"㎡、外壁",null,{"$f":"SUM($R$29:$S$33)","v":0},null,"㎡、その他開口部",{"$nulls":3},{"$f":"$N$40*$Q$40+$N$41*$Q$41","v":0},null,"㎡）"]
[{"$nulls":3},"　冷房期総日射熱取得量",{"$nulls":22},{"$f":"$Z$15+$Z$23+$Z$34","v":{"v":0,"d":"0.00"}},null,null,"[W/(W/㎡)]"]
[{"$nulls":3},"　暖房期総日射熱取得量",{"$nulls":22},{"$f":"IF(共通条件・結果!AA7=\"８地域\",\"-\",$AB$15+$AB$23+$AB$34)","v":{"v":0,"d":"0.00"}},null,null,"[W/(W/㎡)]"]
[{"$nulls":3},"　総熱損失",{"$nulls":22},{"$f":"$AD$15+$AD$23+$AD$34+$AB$42","v":{"v":0,"d":"0.00"}},null,null,"W/K"]

{"sheet":"Ａ（南西）","index":6,"n_rows":48,"n_cols":46,"rows_kept":48,"merged":[[1,1,1,30],[3,21,3,24],[3,25,3,26],[3,27,3,28],[4,1,6,2],[4,3,4,6],[4,7,6,8],[4,9,4,12],[4,13,6,14],[4,15,6,16],[4,17,4,24],[4,25,6,26],[4,27,6,28],[4,29,6,30],[5,3,6,4],[5,5,6,6],[5,9,6,10],[5,11,6,12],[5,17,6,18],[5,19,5,24],[5,34,5,35],[5,38,5,39],[5,41,5,42],[5,44,5,45],[6,19,6,20],[6,21,6,22],[6,23,6,24],[7,1,7,2],[7,3,7,4],[7,5,7,6],[7,7,7,8],[7,9,7,10],[7,11,7,12],[7,13,7,14],[7,15,7,16],[7,17,7,18],[7,19,7,20],[7,21,7,22],[7,23,7,24],[7,25,7,26],[7,27,7,28],[7,29,7,30],[8,1,8,2],[8,3,8,4],[8,5,8,6],[8,7,8,8],[8,9,8,10],[8,11,8,12],[8,13,8,14],[8,15,8,16],[8,17,8,18],[8,19,8,20],[8,21,8,22],[8,23,8,24],[8,25,8,26],[8,27,8,28],[8,29,8,30],[9,1,9,2],[9,3,9,4],[9,5,9,6],[9,7,9,8],[9,9,9,10],[9,11,9,12],[9,13,9,14],[9,15,9,16],[9,17,9,18],[9,19,9,20],[9,21,9,22],[9,23,9,24],[9,25,9,26],[9,27,9,28],[9,29,9,30],[10,1,10,2],[10,3,10,4],[10,5,10,6],[10,7,10,8],[10,9,10,10],[10,11,10,12],[10,13,10,14],[10,15,10,16],[10,17,10,18],[10,19,10,20],[10,21,10,22],[10,23,10,24],[10,25,10,26],[10,27,10,28],[10,29,10,30],[11,1,11,2],[11,3,11,4],[11,5,11,6],[11,7,11,8],[11,9,11,10],[11,11,11,12],[11,13,11,14],[11,15,11,16],[11,17,11,18],[11,19,11,20],[11,21,11,22],[11,23,11,24],[11,25,11,26],[11,27,11,28],[11,29,11,30],[12,1,12,2],[12,3,12,4],[12,5,12,6],[12,7,12,8],[12,9,12,10],[12,11,12,12],[12,13,12,14],[12,15,12,16],[12,17,12,18],[12,19,12,20],[12,21,12,22],[12,23,12,24],[12,25,12,26],[12,27,12,28],[12,29,12,30],[13,1,13,2],[13,3,13,4],[13,5,13,6],[13,7,13,8],[13,9,13,10],[13,11,13,12],[13,13,13,14],[13,15,13,16],[13,17,13,18],[13,19,13,20],[13,21,13,22],[13,23,13,24],[13,25,13,26],[13,27,13,28],[13,29,13,30],[14,1,14,24],[14,25,14,26],[14,27,14,28],[14,29,14,30],[15,44,15,45],[17,11,19,12],[17,13,18,16],[17,17,19,18],[17,19,19,20],[17,21,19,22],[17,23,17,28],[17,29,19,30],[18,23,19,24],[18,25,19,26],[18,27,19,28],[18,34,18,35],[18,44,18,45],[19,13,19,14],[19,15,19,16],[20,11,20,12],[20,13,20,14],[20,15,20,16],[20,17,20,18],[20,19,20,20],[20,21,20,22],[20,23,20,24],[20,25,20,26],[20,27,20,28],[20,29,20,30],[21,11,21,12],[21,13,21,14],[21,15,21,16],[21,17,21,18],[21,19,21,20],[21,21,21,22],[21,23,21,24],[21,25,21,26],[21,27,21,28],[21,29,21,30],[22,11,22,24],[22,25,22,26],[22,27,22,28],[22,29,22,30],[25,11,27,12],[25,13,27,14],[25,15,27,16],[25,17,27,18],[25,19,27,20],[25,21,27,22],[25,23,25,28],[25,29,27,30],[26,23,27,24],[26,25,27,26],[26,27,27,28],[26,34,26,35],[28,11,28,12],[28,13,28,14],[28,15,28,16],[28,17,28,18],[28,19,28,20],[28,21,28,22],[28,23,28,24],[28,25,28,26],[28,27,28,28],[28,29,28,30],[29,11,29,12],[29,13,29,14],[29,15,29,16],[29,17,29,18],[29,19,29,20],[29,21,29,22],[29,23,29,24],[29,25,29,26],[29,27,29,28],[29,29,29,30],[30,11,30,12],[30,13,30,14],[30,15,30,16],[30,17,30,18],[30,19,30,20],[30,21,30,22],[30,23,30,24],[30,25,30,26],[30,27,30,28],[30,29,30,30],[31,11,31,12],[31,13,31,14],[31,15,31,16],[31,17,31,18],[31,19,31,20],[31,21,31,22],[31,23,31,24],[31,25,31,26],[31,27,31,28],[31,29,31,30],[32,11,32,12],[32,13,32,14],[32,15,32,16],[32,17,32,18],[32,19,32,20],[32,21,32,22],[32,23,32,24],[32,25,32,26],[32,27,32,28],[32,29,32,30],[33,11,33,24],[33,25,33,26],[33,27,33,28],[33,29,33,30],[36,11,38,12],[36,13,37,18],[36,19,38,22],[36,23,38,26],[36,27,38,30],[38,13,38,15],[38,16,38,18],[39,11,39,12],[39,13,39,15],[39,16,39,18],[39,19,39,22],[39,23,39,26],[39,27,39,30],[40,11,40,12],[40,13,40,15],[40,16,40,18],[40,19,40,22],[40,23,40,26],[40,27,40,30],[41,11,41,26],[41,27,41,30],[44,1,47,2],[44,9,44,11],[44,14,44,15],[44,18,44,19],[44,22,44,23],[44,28,44,29],[45,26,45,28],[45,29,45,30],[46,26,46,28],[46,29,46,30],[47,26,47,28]]}
[]
[null,"内訳計算シートＡ　　＜南西面＞ の外皮熱損失量と日射熱取得量",{"$nulls":31},"規約"]
[{"$nulls":33},{"$f":"共通条件・結果!AH3","v":1}]
[null,"1）窓の入力",{"$nulls":19},"方位係数",{"$nulls":3},{"$f":"IF(共通条件・結果!AA7=\"８地域\",\"0.517\",IF(共通条件・結果!AA7=\"７地域\",0.479,IF(共通条件・結果!AA7=\"６地域\",0.491,IF(共通条件・結果!AA7=\"５地域\",0.52,IF(共通条件・結果!AA7=\"４地域\",0.481,IF(共通条件・結果!AA7=\"３地域\",0.55,IF(共通条件・結果!AA7=\"２地域\",0.548,IF(共通条件・結果!AA7=\"１地域\",0.526))))))))","v":0.55},null,{"$f":"IF(共通条件・結果!AA7=\"８地域\",\"-\",IF(共通条件・結果!AA7=\"７地域\",0.848,IF(共通条件・結果!AA7=\"６地域\",0.763,IF(共通条件・結果!AA7=\"５地域\",0.815,IF(共通条件・結果!AA7=\"４地域\",0.723,IF(共通条件・結果!AA7=\"３地域\",0.75,IF(共通条件・結果!AA7=\"２地域\",0.753,IF(共通条件・結果!AA7=\"１地域\",0.79))))))))","v":{"v":0.75,"d":"0.750"}}]
[null,"窓番号",null,"寸法[ｍ]",{"$nulls":3},"熱貫流率\n[W/(㎡･K)]",null,"日射熱取得",{"$nulls":3},"付属部材\nの有無",null,"温度差\n係数",null,"取得日射量補正係数の算出",{"$nulls":7},"冷房期\n日射熱\n取得量\n[W/(W/㎡)]",null,"暖房期\n日射熱\n取得量\n[W/(W/㎡)]",null,"熱損失\n[W/K]"]
[{"$nulls":3},"幅",null,"高さ",{"$nulls":3},"加算の\n必要性",null,"日射熱\n取得率\n※1",{"$nulls":5},"ﾃﾞﾌｫﾙﾄ\n値使用",null,"庇による補正計算[ｍ]",{"$nulls":14},"日射熱取得量",{"$nulls":3},"取得日射量補正係数",null,null,"取得日射量補正係数(FALSEの場合)",null,null,"補正熱貫流率"]
[{"$nulls":19},"Z",null,"ｙ1",null,"ｙ2",{"$nulls":9},"日射の有無","冷房期","暖房期",null,null,"冷房期","暖房期",null,"冷房期","暖房期",null,"Ui","⊿R"]
[{"$nulls":25},{"$f":"IF(D8=\"\",\"\",AI8)","v":""},null,{"$f":"IF(D8=\"\",\"\",IF(ISERROR(AJ8),\"-\",AJ8))","v":""},null,{"$f":"IF(D8=\"\",\"\",D8*F8*AS8*P8)","v":""},{"$nulls":3},true,{"$f":"IF(AH8=FALSE,\"0.0\",D8*F8*L8*$Z$4*AM8)","v":0},{"$f":"IF(AH8=FALSE,\"0.0\",D8*F8*L8*$AB$4*AN8)","v":0},null,true,{"$f":"IF(AL8=TRUE,\"0.93\",IF(ISERROR(AP8),\"エラー\",IF(AP8>0.93,\"0.93\",AP8)))","v":"0.93"},{"$f":"IF(AL8=TRUE,\"0.51\",IF(ISERROR(AQ8),\"エラー\",IF(AQ8>0.72,\"0.72\",AQ8)))","v":"0.51"},null,{"$f":"IF(共通条件・結果!$AA$7=\"８地域\",0.01*(16+19*(2*V8+X8)/T8),0.01*(16+24*(2*V8+X8)/T8))","v":{"$error":"#DIV/0!"}},{"$f":"0.01*(5+20*(3*V8+X8)/T8)","v":{"$error":"#DIV/0!"}},null,{"$f":"IF(AT8=\"FALSE\",H8,IF(N8=\"風除室\",1/((1/H8)+0.1),0.5*H8+0.5*(1/((1/H8)+AT8))))","v":0},{"$f":"IF(N8=\"\",\"FALSE\",IF(N8=\"雨戸\",0.1,IF(N8=\"ｼｬｯﾀｰ\",0.1,IF(N8=\"障子\",0.18,IF(N8=\"風除室\",0.1)))))","v":"FALSE"}]
[{"$nulls":25},"",null,"",null,"",{"$nulls":3},true,0,0,null,true,{"$f":"IF(AL9=TRUE,\"0.93\",IF(ISERROR(AP9),\"エラー\",IF(AP9>0.93,\"0.93\",AP9)))","v":"0.93"},{"$f":"IF(AL9=TRUE,\"0.51\",IF(ISERROR(AQ9),\"エラー\",IF(AQ9>0.72,\"0.72\",AQ9)))","v":"0.51"},null,{"$f":"IF(共通条件・結果!$AA$7=\"８地域\",0.01*(16+19*(2*V9+X9)/T9),0.01*(16+24*(2*V9+X9)/T9))","v":{"$error":"#DIV/0!"}},{"$error":"#DIV/0!"},null,{"$f":"IF(AT9=\"FALSE\",H9,IF(N9=\"風除室\",1/((1/H9)+0.1),0.5*H9+0.5*(1/((1/H9)+AT9))))","v":0},"FALSE"]
[{"$nulls":25},"",null,"",null,"",{"$nulls":3},true,0,0,null,true,"0.93","0.51",null,{"$f":"IF(共通条件・結果!$AA$7=\"８地域\",0.01*(16+19*(2*V10+X10)/T10),0.01*(16+24*(2*V10+X10)/T10))","v":{"$error":"#DIV/0!"}},{"$error":"#DIV/0!"},null,0,"FALSE"]
[{"$nulls":25},"",null,"",null,"",{"$nulls":3},true,0,0,null,true,"0.93","0.51",null,{"$f":"IF(共通条件・結果!$AA$7=\"８地域\",0.01*(16+19*(2*V11+X11)/T11),0.01*(16+24*(2*V11+X11)/T11))","v":{"$error":"#DIV/0!"}},{"$error":"#DIV/0!"},null,0,"FALSE"]
[{"$nulls":25},"",null,"",null,"",{"$nulls":3},true,0,0,null,true,"0.93","0.51",null,{"$f":"IF(共通条件・結果!$AA$7=\"８地域\",0.01*(16+19*(2*V12+X12)/T12),0.01*(16+24*(2*V12+X12)/T12))","v":{"$error":"#DIV/0!"}},{"$error":"#DIV/0!"},null,0,"FALSE"]
[{"$nulls":25},"",null,"",null,"",{"$nulls":3},true,0,0,null,true,"0.93","0.51",null,{"$f":"IF(共通条件・結果!$AA$7=\"８地域\",0.01*(16+19*(2*V13+X13)/T13),0.01*(16+24*(2*V13+X13)/T13))","v":{"$error":"#DIV/0!"}},{"$error":"#DIV/0!"},null,0,"FALSE"]
[{"$nulls":25},"",null,"",null,"",{"$nulls":3},true,0,0,null,true,"0.93","0.51",null,{"$f":"IF(共通条件・結果!$AA$7=\"８地域\",0.01*(16+19*(2*V14+X14)/T14),0.01*(16+24*(2*V14+X14)/T14))","v":{"$error":"#DIV/0!"}},{"$error":"#DIV/0!"},null,0,"FALSE"]
[null,"窓 ＜南西面＞ 各値合計",{"$nulls":23},{"$f":"SUM(Z8:AA14)","v":{"v":0,"d":"0.00"}},null,{"$f":"IF(共通条件・結果!AA7=\"８地域\",\"-\",SUM(AB8:AC14))","v":{"v":0,"d":"0.00"}},null,{"$f":"SUM(AD8:AE14)","v":{"v":0,"d":"0.00"}}]
[]
[{"$nulls":11},"2）ドアの入力"]
[{"$nulls":11},"ドア番号",null,"寸法[ｍ]",{"$nulls":3},"熱貫流率\n[W/(㎡･K)]",null,"付属部材\nの有無",null,"温度差\n係数",null,"日射熱取得[W/(W/㎡)]",{"$nulls":5},"熱損失\n[W/K]"]
[{"$nulls":23},"加算の\n必要性",null,"冷房期\n日射熱\n取得量",null,"暖房期\n日射熱\n取得量",{"$nulls":6},"日射熱取得量",{"$nulls":9},"補正熱貫流率"]
[{"$nulls":13},"幅",null,"高さ",{"$nulls":17},"日射の有無","冷房期","暖房期",{"$nulls":8},"Ui","⊿R"]
[{"$nulls":25},{"$f":"IF(N21=\"\",\"\",AI21)","v":""},null,{"$f":"IF(N21=\"\",\"\",IF(ISERROR(AJ21),\"-\",AJ21))","v":""},null,{"$f":"IF(N21=\"\",\"\",N21*P21*AS21*V21)","v":""},{"$nulls":3},true,{"$f":"IF(AH21=FALSE,\"0.0\",IF(AH21=TRUE,N21*P21*R21*0.034*$Z$4,\"-\"))","v":0},{"$f":"IF(AH21=FALSE,\"0.0\",IF(ISERROR(N21*P21*R21*0.034*$AB$4),\"-\",N21*P21*R21*0.034*$AB$4))","v":0},{"$nulls":8},{"$f":"IF(AT21=\"FALSE\",R21,IF(T21=\"風除室\",1/((1/R21)+0.1),0.5*R21+0.5*(1/((1/R21)+AT21))))","v":0},{"$f":"IF(T21=\"\",\"FALSE\",IF(T21=\"雨戸\",0.1,IF(T21=\"ｼｬｯﾀｰ\",0.1,IF(T21=\"障子\",0.18,IF(T21=\"風除室\",0.1)))))","v":"FALSE"}]
[{"$nulls":25},{"$f":"IF(N22=\"\",\"\",AI22)","v":""},null,{"$f":"IF(N22=\"\",\"\",IF(ISERROR(AJ22),\"-\",AJ22))","v":""},null,{"$f":"IF(N22=\"\",\"\",N22*P22*AS22*V22)","v":""},{"$nulls":3},true,{"$f":"IF(AH22=FALSE,\"0.0\",IF(AH22=TRUE,N22*P22*R22*0.034*$Z$4,\"-\"))","v":0},{"$f":"IF(AH22=FALSE,\"0.0\",IF(ISERROR(N22*P22*R22*0.034*$AB$4),\"-\",N22*P22*R22*0.034*$AB$4))","v":0},{"$nulls":8},{"$f":"IF(AT22=\"FALSE\",R22,IF(T22=\"風除室\",1/((1/R22)+0.1),0.5*R22+0.5*(1/((1/R22)+AT22))))","v":0},{"$f":"IF(T22=\"\",\"FALSE\",IF(T22=\"雨戸\",0.1,IF(T22=\"ｼｬｯﾀｰ\",0.1,IF(T22=\"障子\",0.18,IF(T22=\"風除室\",0.1)))))","v":"FALSE"}]
[{"$nulls":11},"　ドア ＜南西面＞ 各値合計",{"$nulls":13},{"$f":"SUM(Z21:AA22)","v":{"v":0,"d":"0.00"}},null,{"$f":"SUM(AB21:AC22)","v":{"v":0,"d":"0.00"}},null,{"$f":"SUM(AD21:AE22)","v":{"v":0,"d":"0.00"}}]
[]
[{"$nulls":11},"3）外壁・界壁等の入力"]
[{"$nulls":11},"仕様番号",null,"外壁\n面積\n[㎡]",null,"除外窓\n等面積\n[㎡]",null,"計算対象\n外壁面積[㎡]",null,"熱貫流率\n[W/(㎡･K)]",null,"温度差\n係数",null,"日射熱取得[W/(W/㎡)]",{"$nulls":5},"熱損失\n[W/K]"]
[{"$nulls":23},"加算の\n必要性",null,"冷房期\n日射熱\n取得量",null,"暖房期\n日射熱\n取得量",{"$nulls":6},"日射熱取得量"]
[{"$nulls":33},"日射の有無","冷房期","暖房期"]
[{"$nulls":17},{"$f":"IF(N29=\"\",\"\",N29-P29)","v":""},{"$nulls":7},{"$f":"IF(N29=\"\",\"\",AI29)","v":""},null,{"$f":"IF(N29=\"\",\"\",AJ29)","v":""},null,{"$f":"IF(N29=\"\",\"\",R29*T29*V29)","v":""},{"$nulls":3},true,{"$f":"IF(AH29=FALSE,\"0.0\",IF(AH29=TRUE,R29*T29*0.034*$Z$4,\"-\"))","v":{"$error":"#VALUE!"}},{"$f":"IF(AH29=FALSE,\"0.0\",IF(ISERROR(R29*T29*0.034*$AB$4),\"-\",R29*T29*0.034*$AB$4))","v":"-"}]
[{"$nulls":17},{"$f":"IF(N30=\"\",\"\",N30-P30)","v":""},{"$nulls":7},{"$f":"IF(N30=\"\",\"\",AI30)","v":""},null,{"$f":"IF(N30=\"\",\"\",AJ30)","v":""},null,{"$f":"IF(N30=\"\",\"\",R30*T30*V30)","v":""},{"$nulls":3},true,{"$f":"IF(AH30=FALSE,\"0.0\",IF(AH30=TRUE,R30*T30*0.034*$Z$4,\"-\"))","v":{"$error":"#VALUE!"}},{"$f":"IF(AH30=FALSE,\"0.0\",IF(ISERROR(R30*T30*0.034*$AB$4),\"-\",R30*T30*0.034*$AB$4))","v":"-"}]
[{"$nulls":17},{"$f":"IF(N31=\"\",\"\",N31-P31)","v":""},{"$nulls":7},{"$f":"IF(N31=\"\",\"\",AI31)","v":""},null,{"$f":"IF(N31=\"\",\"\",AJ31)","v":""},null,{"$f":"IF(N31=\"\",\"\",R31*T31*V31)","v":""},{"$nulls":3},true,{"$f":"IF(AH31=FALSE,\"0.0\",IF(AH31=TRUE,R31*T31*0.034*$Z$4,\"-\"))","v":{"$error":"#VALUE!"}},{"$f":"IF(AH31=FALSE,\"0.0\",IF(ISERROR(R31*T31*0.034*$AB$4),\"-\",R31*T31*0.034*$AB$4))","v":"-"}]
[{"$nulls":17},{"$f":"IF(N32=\"\",\"\",N32-P32)","v":""},{"$nulls":7},{"$f":"IF(N32=\"\",\"\",AI32)","v":""},null,{"$f":"IF(N32=\"\",\"\",AJ32)","v":""},null,{"$f":"IF(N32=\"\",\"\",R32*T32*V32)","v":""},{"$nulls":3},true,{"$f":"IF(AH32=FALSE,\"0.0\",IF(AH32=TRUE,R32*T32*0.034*$Z$4,\"-\"))","v":{"$error":"#VALUE!"}},{"$f":"IF(AH32=FALSE,\"0.0\",IF(ISERROR(R32*T32*0.034*$AB$4),\"-\",R32*T32*0.034*$AB$4))","v":"-"}]
[{"$nulls":17},{"$f":"IF(N33=\"\",\"\",N33-P33)","v":""},{"$nulls":7},{"$f":"IF(N33=\"\",\"\",AI33)","v":""},null,{"$f":"IF(N33=\"\",\"\",AJ33)","v":""},null,{"$f":"IF(N33=\"\",\"\",R33*T33*V33)","v":""},{"$nulls":3},true,{"$f":"IF(AH33=FALSE,\"0.0\",IF(AH33=TRUE,R33*T33*0.034*$Z$4,\"-\"))","v":{"$error":"#VALUE!"}},{"$f":"IF(AH33=FALSE,\"0.0\",IF(ISERROR(R33*T33*0.034*$AB$4),\"-\",R33*T33*0.034*$AB$4))","v":"-"}]
[{"$nulls":11},"外壁・界壁等 ＜南西面＞ 各値合計",{"$nulls":13},{"$f":"SUM(Z29:AA33)","v":{"v":0,"d":"0.00"}},null,{"$f":"IF(共通条件・結果!AA7=\"８地域\",\"-\",SUM(AB29:AC33))","v":{"v":0,"d":"0.00"}},null,{"$f":"SUM(AD29:AE33)","v":{"v":0,"d":"0.00"}}]
[{"$nulls":11},"※基礎壁は、こちらに入力してください。"]
[{"$nulls":11},"4）隣接空間に通ずる開口部の入力"]
[{"$nulls":11},"開口部\n番号",null,"寸法[ｍ]",{"$nulls":5},"熱貫流率\n[W/(㎡･K)]",{"$nulls":3},"温度差\n係数",{"$nulls":3},"熱損失\n[W/K]"]
[]
[{"$nulls":13},"幅",null,null,"高さ"]
[{"$nulls":27},{"$f":"IF(N40=\"\",\"\",N40*Q40*T40*X40)","v":""}]
[{"$nulls":27},{"$f":"IF(N41=\"\",\"\",N41*Q41*T41*X41)","v":""}]
[{"$nulls":11},"隣接空間に通ずる開口部 ＜南西面＞ 各値合計",{"$nulls":15},{"$f":"SUM(AB40:AB41)","v":{"v":0,"d":"0.00"}}]
[]
[null,"5）住宅 ＜南西面＞ 計算結果"]
[null,"南西面",null,"　外皮等面積（内訳）",{"$nulls":5},{"$f":"$O45+$S$45+$W$45+$AC$45","v":{"v":0,"d":"0.00"}},null,null,"㎡","（窓",{"$f":"$D$8*$F$8+$D$9*$F$9+$D$10*$F$10+$D$11*$F$11+$D$12*$F$12+$D$13*$F$13+$D$14*$F$14","v":0},null,"㎡、ドア",null,{"$f":"$N$21*$P$21+$N$22*$P$22","v":0},null,"㎡、外壁",null,{"$f":"SUM($R$29:$S$33)","v":0},null,"㎡、その他開口部",{"$nulls":3},{"$f":"$N$40*$Q$40+$N$41*$Q$41","v":0},null,"㎡）"]
[{"$nulls":3},"　冷房期総日射熱取得量",{"$nulls":22},{"$f":"$Z$15+$Z$23+$Z$34","v":{"v":0,"d":"0.00"}},null,null,"[W/(W/㎡)]"]
[{"$nulls":3},"　暖房期総日射熱取得量",{"$nulls":22},{"$f":"IF(共通条件・結果!AA7=\"８地域\",\"-\",$AB$15+$AB$23+$AB$34)","v":{"v":0,"d":"0.00"}},null,null,"[W/(W/㎡)]"]
[{"$nulls":3},"　総熱損失",{"$nulls":22},{"$f":"$AD$15+$AD$23+$AD$34+$AB$42","v":{"v":0,"d":"0.00"}},null,null,"W/K"]

{"sheet":"Ａ（西）","index":7,"n_rows":48,"n_cols":46,"rows_kept":48,"merged":[[1,1,1,30],[3,21,3,24],[3,25,3,26],[3,27,3,28],[4,1,6,2],[4,3,4,6],[4,7,6,8],[4,9,4,12],[4,13,6,14],[4,15,6,16],[4,17,4,24],[4,25,6,26],[4,27,6,28],[4,29,6,30],[5,3,6,4],[5,5,6,6],[5,9,6,10],[5,11,6,12],[5,17,6,18],[5,19,5,24],[5,34,5,35],[5,38,5,39],[5,41,5,42],[5,44,5,45],[6,19,6,20],[6,21,6,22],[6,23,6,24],[7,1,7,2],[7,3,7,4],[7,5,7,6],[7,7,7,8],[7,9,7,10],[7,11,7,12],[7,13,7,14],[7,15,7,16],[7,17,7,18],[7,19,7,20],[7,21,7,22],[7,23,7,24],[7,25,7,26],[7,27,7,28],[7,29,7,30],[8,1,8,2],[8,3,8,4],[8,5,8,6],[8,7,8,8],[8,9,8,10],[8,11,8,12],[8,13,8,14],[8,15,8,16],[8,17,8,18],[8,19,8,20],[8,21,8,22],[8,23,8,24],[8,25,8,26],[8,27,8,28],[8,29,8,30],[9,1,9,2],[9,3,9,4],[9,5,9,6],[9,7,9,8],[9,9,9,10],[9,11,9,12],[9,13,9,14],[9,15,9,16],[9,17,9,18],[9,19,9,20],[9,21,9,22],[9,23,9,24],[9,25,9,26],[9,27,9,28],[9,29,9,30],[10,1,10,2],[10,3,10,4],[10,5,10,6],[10,7,10,8],[10,9,10,10],[10,11,10,12],[10,13,10,14],[10,15,10,16],[10,17,10,18],[10,19,10,20],[10,21,10,22],[10,23,10,24],[10,25,10,26],[10,27,10,28],[10,29,10,30],[11,1,11,2],[11,3,11,4],[11,5,11,6],[11,7,11,8],[11,9,11,10],[11,11,11,12],[11,13,11,14],[11,15,11,16],[11,17,11,18],[11,19,11,20],[11,21,11,22],[11,23,11,24],[11,25,11,26],[11,27,11,28],[11,29,11,30],[12,1,12,2],[12,3,12,4],[12,5,12,6],[12,7,12,8],[12,9,12,10],[12,11,12,12],[12,13,12,14],[12,15,12,16],[12,17,12,18],[12,19,12,20],[12,21,12,22],[12,23,12,24],[12,25,12,26],[12,27,12,28],[12,29,12,30],[13,1,13,2],[13,3,13,4],[13,5,13,6],[13,7,13,8],[13,9,13,10],[13,11,13,12],[13,13,13,14],[13,15,13,16],[13,17,13,18],[13,19,13,20],[13,21,13,22],[13,23,13,24],[13,25,13,26],[13,27,13,28],[13,29,13,30],[14,1,14,24],[14,25,14,26],[14,27,14,28],[14,29,14,30],[15,44,15,45],[17,11,19,12],[17,13,18,16],[17,17,19,18],[17,19,19,20],[17,21,19,22],[17,23,17,28],[17,29,19,30],[18,23,19,24],[18,25,19,26],[18,27,19,28],[18,34,18,35],[18,44,18,45],[19,13,19,14],[19,15,19,16],[20,11,20,12],[20,13,20,14],[20,15,20,16],[20,17,20,18],[20,19,20,20],[20,21,20,22],[20,23,20,24],[20,25,20,26],[20,27,20,28],[20,29,20,30],[21,11,21,12],[21,13,21,14],[21,15,21,16],[21,17,21,18],[21,19,21,20],[21,21,21,22],[21,23,21,24],[21,25,21,26],[21,27,21,28],[21,29,21,30],[22,11,22,24],[22,25,22,26],[22,27,22,28],[22,29,22,30],[25,11,27,12],[25,13,27,14],[25,15,27,16],[25,17,27,18],[25,19,27,20],[25,21,27,22],[25,23,25,28],[25,29,27,30],[26,23,27,24],[26,25,27,26],[26,27,27,28],[26,34,26,35],[28,11,28,12],[28,13,28,14],[28,15,28,16],[28,17,28,18],[28,19,28,20],[28,21,28,22],[28,23,28,24],[28,25,28,26],[28,27,28,28],[28,29,28,30],[29,11,29,12],[29,13,29,14],[29,15,29,16],[29,17,29,18],[29,19,29,20],[29,21,29,22],[29,23,29,24],[29,25,29,26],[29,27,29,28],[29,29,29,30],[30,11,30,12],[30,13,30,14],[30,15,30,16],[30,17,30,18],[30,19,30,20],[30,21,30,22],[30,23,30,24],[30,25,30,26],[30,27,30,28],[30,29,30,30],[31,11,31,12],[31,13,31,14],[31,15,31,16],[31,17,31,18],[31,19,31,20],[31,21,31,22],[31,23,31,24],[31,25,31,26],[31,27,31,28],[31,29,31,30],[32,11,32,12],[32,13,32,14],[32,15,32,16],[32,17,32,18],[32,19,32,20],[32,21,32,22],[32,23,32,24],[32,25,32,26],[32,27,32,28],[32,29,32,30],[33,11,33,24],[33,25,33,26],[33,27,33,28],[33,29,33,30],[36,11,38,12],[36,13,37,18],[36,19,38,22],[36,23,38,26],[36,27,38,30],[38,13,38,15],[38,16,38,18],[39,11,39,12],[39,13,39,15],[39,16,39,18],[39,19,39,22],[39,23,39,26],[39,27,39,30],[40,11,40,12],[40,13,40,15],[40,16,40,18],[40,19,40,22],[40,23,40,26],[40,27,40,30],[41,11,41,26],[41,27,41,30],[44,1,47,2],[44,9,44,11],[44,14,44,15],[44,18,44,19],[44,22,44,23],[44,28,44,29],[45,26,45,28],[45,29,45,30],[46,26,46,28],[46,29,46,30],[47,26,47,28]]}
[]
[null,"内訳計算シートＡ　　＜西面＞ の外皮熱損失量と日射熱取得量",{"$nulls":31},"規約"]
[{"$nulls":33},{"$f":"共通条件・結果!AH3","v":1}]
[null,"1）窓の入力",{"$nulls":19},"方位係数",{"$nulls":3},{"$f":"IF(共通条件・結果!AA7=\"８地域\",\"0.505\",IF(共通条件・結果!AA7=\"７地域\",0.495,IF(共通条件・結果!AA7=\"６地域\",0.504,IF(共通条件・結果!AA7=\"５地域\",0.518,IF(共通条件・結果!AA7=\"４地域\",0.481,IF(共通条件・結果!AA7=\"３地域\",0.553,IF(共通条件・結果!AA7=\"２地域\",0.529,IF(共通条件・結果!AA7=\"１地域\",0.508))))))))","v":0.553},null,{"$f":"IF(共通条件・結果!AA7=\"８地域\",\"-\",IF(共通条件・結果!AA7=\"７地域\",0.548,IF(共通条件・結果!AA7=\"６地域\",0.523,IF(共通条件・結果!AA7=\"５地域\",0.538,IF(共通条件・結果!AA7=\"４地域\",0.527,IF(共通条件・結果!AA7=\"３地域\",0.542,IF(共通条件・結果!AA7=\"２地域\",0.544,IF(共通条件・結果!AA7=\"１地域\",0.535))))))))","v":0.542}]
[null,"窓番号",null,"寸法[ｍ]",{"$nulls":3},"熱貫流率\n[W/(㎡･K)]",null,"日射熱取得",{"$nulls":3},"付属部材\nの有無",null,"温度差\n係数",null,"取得日射量補正係数の算出",{"$nulls":7},"冷房期\n日射熱\n取得量\n[W/(W/㎡)]",null,"暖房期\n日射熱\n取得量\n[W/(W/㎡)]",null,"熱損失\n[W/K]"]
[{"$nulls":3},"幅",null,"高さ",{"$nulls":3},"加算の\n必要性",null,"日射熱\n取得率\n※1",{"$nulls":5},"ﾃﾞﾌｫﾙﾄ\n値使用",null,"庇による補正計算[ｍ]",{"$nulls":14},"日射熱取得量",{"$nulls":3},"取得日射量補正係数",null,null,"取得日射量補正係数(FALSEの場合)",null,null,"補正熱貫流率"]
[{"$nulls":19},"Z",null,"ｙ1",null,"ｙ2",{"$nulls":9},"日射の有無","冷房期","暖房期",null,null,"冷房期","暖房期",null,"冷房期","暖房期",null,"Ui","⊿R"]
[{"$nulls":25},{"$f":"IF(D8=\"\",\"\",AI8)","v":""},null,{"$f":"IF(D8=\"\",\"\",IF(ISERROR(AJ8),\"-\",AJ8))","v":""},null,{"$f":"IF(D8=\"\",\"\",D8*F8*AS8*P8)","v":""},{"$nulls":3},true,{"$f":"IF(AH8=FALSE,\"0.0\",D8*F8*L8*$Z$4*AM8)","v":0},{"$f":"IF(AH8=FALSE,\"0.0\",D8*F8*L8*$AB$4*AN8)","v":0},null,true,{"$f":"IF(AL8=TRUE,\"0.93\",IF(ISERROR(AP8),\"エラー\",IF(AP8>0.93,\"0.93\",AP8)))","v":"0.93"},{"$f":"IF(AL8=TRUE,\"0.51\",IF(ISERROR(AQ8),\"エラー\",IF(AQ8>0.72,\"0.72\",AQ8)))","v":"0.51"},null,{"$f":"0.01*(16+24*(2*V8+X8)/T8)","v":{"$error":"#DIV/0!"}},{"$f":"0.01*(10+15*(2*V8+X8)/T8)","v":{"$error":"#DIV/0!"}},null,{"$f":"IF(AT8=\"FALSE\",H8,IF(N8=\"風除室\",1/((1/H8)+0.1),0.5*H8+0.5*(1/((1/H8)+AT8))))","v":0},{"$f":"IF(N8=\"\",\"FALSE\",IF(N8=\"雨戸\",0.1,IF(N8=\"ｼｬｯﾀｰ\",0.1,IF(N8=\"障子\",0.18,IF(N8=\"風除室\",0.1)))))","v":"FALSE"}]
[{"$nulls":25},"",null,"",null,"",{"$nulls":3},true,0,0,null,true,{"$f":"IF(AL9=TRUE,\"0.93\",IF(ISERROR(AP9),\"エラー\",IF(AP9>0.93,\"0.93\",AP9)))","v":"0.93"},{"$f":"IF(AL9=TRUE,\"0.51\",IF(ISERROR(AQ9),\"エラー\",IF(AQ9>0.72,\"0.72\",AQ9)))","v":"0.51"},null,{"$error":"#DIV/0!"},{"$error":"#DIV/0!"},null,{"$f":"IF(AT9=\"FALSE\",H9,IF(N9=\"風除室\",1/((1/H9)+0.1),0.5*H9+0.5*(1/((1/H9)+AT9))))","v":0},"FALSE"]
[{"$nulls":25},"",null,"",null,"",{"$nulls":3},true,0,0,null,true,"0.93","0.51",null,{"$error":"#DIV/0!"},{"$error":"#DIV/0!"},null,0,"FALSE"]
[{"$nulls":25},"",null,"",null,"",{"$nulls":3},true,0,0,null,true,"0.93","0.51",null,{"$error":"#DIV/0!"},{"$error":"#DIV/0!"},null,0,"FALSE"]
[{"$nulls":25},"",null,"",null,"",{"$nulls":3},true,0,0,null,true,"0.93","0.51",null,{"$error":"#DIV/0!"},{"$error":"#DIV/0!"},null,0,"FALSE"]
[{"$nulls":25},"",null,"",null,"",{"$nulls":3},true,0,0,null,true,"0.93","0.51",null,{"$error":"#DIV/0!"},{"$error":"#DIV/0!"},null,0,"FALSE"]
[{"$nulls":25},"",null,"",null,"",{"$nulls":3},true,0,0,null,true,"0.93","0.51",null,{"$error":"#DIV/0!"},{"$error":"#DIV/0!"},null,0,"FALSE"]
[null,"窓 ＜西面＞ 各値合計",{"$nulls":23},{"$f":"SUM(Z8:AA14)","v":{"v":0,"d":"0.00"}},null,{"$f":"IF(共通条件・結果!AA7=\"８地域\",\"-\",SUM(AB8:AC14))","v":{"v":0,"d":"0.00"}},null,{"$f":"SUM(AD8:AE14)","v":{"v":0,"d":"0.00"}}]
[]
[{"$nulls":11},"2）ドアの入力"]
[{"$nulls":11},"ドア番号",null,"寸法[ｍ]",{"$nulls":3},"熱貫流率\n[W/(㎡･K)]",null,"付属部材\nの有無",null,"温度差\n係数",null,"日射熱取得[W/(W/㎡)]",{"$nulls":5},"熱損失\n[W/K]"]
[{"$nulls":23},"加算の\n必要性",null,"冷房期\n日射熱\n取得量",null,"暖房期\n日射熱\n取得量",{"$nulls":6},"日射熱取得量",{"$nulls":9},"補正熱貫流率"]
[{"$nulls":13},"幅",null,"高さ",{"$nulls":17},"日射の有無","冷房期","暖房期",{"$nulls":8},"Ui","⊿R"]
[{"$nulls":25},{"$f":"IF(N21=\"\",\"\",AI21)","v":""},null,{"$f":"IF(N21=\"\",\"\",IF(ISERROR(AJ21),\"-\",AJ21))","v":""},null,{"$f":"IF(N21=\"\",\"\",N21*P21*AS21*V21)","v":""},{"$nulls":3},true,{"$f":"IF(AH21=FALSE,\"0.0\",IF(AH21=TRUE,N21*P21*R21*0.034*$Z$4,\"-\"))","v":0},{"$f":"IF(AH21=FALSE,\"0.0\",IF(ISERROR(N21*P21*R21*0.034*$AB$4),\"-\",N21*P21*R21*0.034*$AB$4))","v":0},{"$nulls":8},{"$f":"IF(AT21=\"FALSE\",R21,IF(T21=\"風除室\",1/((1/R21)+0.1),0.5*R21+0.5*(1/((1/R21)+AT21))))","v":0},{"$f":"IF(T21=\"\",\"FALSE\",IF(T21=\"雨戸\",0.1,IF(T21=\"ｼｬｯﾀｰ\",0.1,IF(T21=\"障子\",0.18,IF(T21=\"風除室\",0.1)))))","v":"FALSE"}]
[{"$nulls":25},{"$f":"IF(N22=\"\",\"\",AI22)","v":""},null,{"$f":"IF(N22=\"\",\"\",IF(ISERROR(AJ22),\"-\",AJ22))","v":""},null,{"$f":"IF(N22=\"\",\"\",N22*P22*AS22*V22)","v":""},{"$nulls":3},true,{"$f":"IF(AH22=FALSE,\"0.0\",IF(AH22=TRUE,N22*P22*R22*0.034*$Z$4,\"-\"))","v":0},{"$f":"IF(AH22=FALSE,\"0.0\",IF(ISERROR(N22*P22*R22*0.034*$AB$4),\"-\",N22*P22*R22*0.034*$AB$4))","v":0},{"$nulls":8},{"$f":"IF(AT22=\"FALSE\",R22,IF(T22=\"風除室\",1/((1/R22)+0.1),0.5*R22+0.5*(1/((1/R22)+AT22))))","v":0},{"$f":"IF(T22=\"\",\"FALSE\",IF(T22=\"雨戸\",0.1,IF(T22=\"ｼｬｯﾀｰ\",0.1,IF(T22=\"障子\",0.18,IF(T22=\"風除室\",0.1)))))","v":"FALSE"}]
[{"$nulls":11},"　ドア ＜西面＞ 各値合計",{"$nulls":13},{"$f":"SUM(Z21:AA22)","v":{"v":0,"d":"0.00"}},null,{"$f":"SUM(AB21:AC22)","v":{"v":0,"d":"0.00"}},null,{"$f":"SUM(AD21:AE22)","v":{"v":0,"d":"0.00"}}]
[]
[{"$nulls":11},"3）外壁・界壁等の入力"]
[{"$nulls":11},"仕様番号",null,"外壁\n面積\n[㎡]",null,"除外窓\n等面積\n[㎡]",null,"計算対象\n外壁面積[㎡]",null,"熱貫流率\n[W/(㎡･K)]",null,"温度差\n係数",null,"日射熱取得[W/(W/㎡)]",{"$nulls":5},"熱損失\n[W/K]"]
[{"$nulls":23},"加算の\n必要性",null,"冷房期\n日射熱\n取得量",null,"暖房期\n日射熱\n取得量",{"$nulls":6},"日射熱取得量"]
[{"$nulls":33},"日射の有無","冷房期","暖房期"]
[{"$nulls":17},{"$f":"IF(N29=\"\",\"\",N29-P29)","v":""},{"$nulls":7},{"$f":"IF(N29=\"\",\"\",AI29)","v":""},null,{"$f":"IF(N29=\"\",\"\",AJ29)","v":""},null,{"$f":"IF(N29=\"\",\"\",R29*T29*V29)","v":""},{"$nulls":3},true,{"$f":"IF(AH29=FALSE,\"0.0\",IF(AH29=TRUE,R29*T29*0.034*$Z$4,\"-\"))","v":{"$error":"#VALUE!"}},{"$f":"IF(AH29=FALSE,\"0.0\",IF(ISERROR(R29*T29*0.034*$AB$4),\"-\",R29*T29*0.034*$AB$4))","v":"-"}]
[{"$nulls":17},{"$f":"IF(N30=\"\",\"\",N30-P30)","v":""},{"$nulls":7},{"$f":"IF(N30=\"\",\"\",AI30)","v":""},null,{"$f":"IF(N30=\"\",\"\",AJ30)","v":""},null,{"$f":"IF(N30=\"\",\"\",R30*T30*V30)","v":""},{"$nulls":3},true,{"$f":"IF(AH30=FALSE,\"0.0\",IF(AH30=TRUE,R30*T30*0.034*$Z$4,\"-\"))","v":{"$error":"#VALUE!"}},{"$f":"IF(AH30=FALSE,\"0.0\",IF(ISERROR(R30*T30*0.034*$AB$4),\"-\",R30*T30*0.034*$AB$4))","v":"-"}]
[{"$nulls":17},{"$f":"IF(N31=\"\",\"\",N31-P31)","v":""},{"$nulls":7},{"$f":"IF(N31=\"\",\"\",AI31)","v":""},null,{"$f":"IF(N31=\"\",\"\",AJ31)","v":""},null,{"$f":"IF(N31=\"\",\"\",R31*T31*V31)","v":""},{"$nulls":3},true,{"$f":"IF(AH31=FALSE,\"0.0\",IF(AH31=TRUE,R31*T31*0.034*$Z$4,\"-\"))","v":{"$error":"#VALUE!"}},{"$f":"IF(AH31=FALSE,\"0.0\",IF(ISERROR(R31*T31*0.034*$AB$4),\"-\",R31*T31*0.034*$AB$4))","v":"-"}]
[{"$nulls":17},{"$f":"IF(N32=\"\",\"\",N32-P32)","v":""},{"$nulls":7},{"$f":"IF(N32=\"\",\"\",AI32)","v":""},null,{"$f":"IF(N32=\"\",\"\",AJ32)","v":""},null,{"$f":"IF(N32=\"\",\"\",R32*T32*V32)","v":""},{"$nulls":3},true,{"$f":"IF(AH32=FALSE,\"0.0\",IF(AH32=TRUE,R32*T32*0.034*$Z$4,\"-\"))","v":{"$error":"#VALUE!"}},{"$f":"IF(AH32=FALSE,\"0.0\",IF(ISERROR(R32*T32*0.034*$AB$4),\"-\",R32*T32*0.034*$AB$4))","v":"-"}]
[{"$nulls":17},{"$f":"IF(N33=\"\",\"\",N33-P33)","v":""},{"$nulls":7},{"$f":"IF(N33=\"\",\"\",AI33)","v":""},null,{"$f":"IF(N33=\"\",\"\",AJ33)","v":""},null,{"$f":"IF(N33=\"\",\"\",R33*T33*V33)","v":""},{"$nulls":3},true,{"$f":"IF(AH33=FALSE,\"0.0\",IF(AH33=TRUE,R33*T33*0.034*$Z$4,\"-\"))","v":{"$error":"#VALUE!"}},{"$f":"IF(AH33=FALSE,\"0.0\",IF(ISERROR(R33*T33*0.034*$AB$4),\"-\",R33*T33*0.034*$AB$4))","v":"-"}]
[{"$nulls":11},"外壁・界壁等 ＜西面＞ 各値合計",{"$nulls":13},{"$f":"SUM(Z29:AA33)","v":{"v":0,"d":"0.00"}},null,{"$f":"IF(共通条件・結果!AA7=\"８地域\",\"-\",SUM(AB29:AC33))","v":{"v":0,"d":"0.00"}},null,{"$f":"SUM(AD29:AE33)","v":{"v":0,"d":"0.00"}}]
[{"$nulls":11},"※基礎壁は、こちらに入力してください。"]
[{"$nulls":11},"4）隣接空間に通ずる開口部の入力"]
[{"$nulls":11},"開口部\n番号",null,"寸法[ｍ]",{"$nulls":5},"熱貫流率\n[W/(㎡･K)]",{"$nulls":3},"温度差\n係数",{"$nulls":3},"熱損失\n[W/K]"]
[]
[{"$nulls":13},"幅",null,null,"高さ"]
[{"$nulls":27},{"$f":"IF(N40=\"\",\"\",N40*Q40*T40*X40)","v":""}]
[{"$nulls":27},{"$f":"IF(N41=\"\",\"\",N41*Q41*T41*X41)","v":""}]
[{"$nulls":11},"隣接空間に通ずる開口部 ＜西面＞ 各値合計",{"$nulls":15},{"$f":"SUM(AB40:AB41)","v":{"v":0,"d":"0.00"}}]
[]
[null,"5）住宅 ＜西面＞ 計算結果"]
[null,"西面",null,"　外皮等面積（内訳）",{"$nulls":5},{"$f":"$O45+$S$45+$W$45+$AC$45","v":{"v":0,"d":"0.00"}},null,null,"㎡","（窓",{"$f":"$D$8*$F$8+$D$9*$F$9+$D$10*$F$10+$D$11*$F$11+$D$12*$F$12+$D$13*$F$13+$D$14*$F$14","v":0},null,"㎡、ドア",null,{"$f":"$N$21*$P$21+$N$22*$P$22","v":0},null,"㎡、外壁",null,{"$f":"SUM($R$29:$S$33)","v":0},null,"㎡、その他開口部",{"$nulls":3},{"$f":"$N$40*$Q$40+$N$41*$Q$41","v":0},null,"㎡）"]
[{"$nulls":3},"　冷房期総日射熱取得量",{"$nulls":22},{"$f":"$Z$15+$Z$23+$Z$34","v":{"v":0,"d":"0.00"}},null,null,"[W/(W/㎡)]"]
[{"$nulls":3},"　暖房期総日射熱取得量",{"$nulls":22},{"$f":"IF(共通条件・結果!AA7=\"８地域\",\"-\",$AB$15+$AB$23+$AB$34)","v":{"v":0,"d":"0.00"}},null,null,"[W/(W/㎡)]"]
[{"$nulls":3},"　総熱損失",{"$nulls":22},{"$f":"$AD$15+$AD$23+$AD$34+$AB$42","v":{"v":0,"d":"0.00"}},null,null,"W/K"]

{"sheet":"Ａ（北西）","index":8,"n_rows":48,"n_cols":46,"rows_kept":48,"merged":[[1,1,1,30],[3,21,3,24],[3,25,3,26],[3,27,3,28],[4,1,6,2],[4,3,4,6],[4,7,6,8],[4,9,4,12],[4,13,6,14],[4,15,6,16],[4,17,4,24],[4,25,6,26],[4,27,6,28],[4,29,6,30],[5,3,6,4],[5,5,6,6],[5,9,6,10],[5,11,6,12],[5,17,6,18],[5,19,5,24],[5,34,5,35],[5,38,5,39],[5,41,5,42],[5,44,5,45],[6,19,6,20],[6,21,6,22],[6,23,6,24],[7,1,7,2],[7,3,7,4],[7,5,7,6],[7,7,7,8],[7,9,7,10],[7,11,7,12],[7,13,7,14],[7,15,7,16],[7,17,7,18],[7,19,7,20],[7,21,7,22],[7,23,7,24],[7,25,7,26],[7,27,7,28],[7,29,7,30],[8,1,8,2],[8,3,8,4],[8,5,8,6],[8,7,8,8],[8,9,8,10],[8,11,8,12],[8,13,8,14],[8,15,8,16],[8,17,8,18],[8,19,8,20],[8,21,8,22],[8,23,8,24],[8,25,8,26],[8,27,8,28],[8,29,8,30],[9,1,9,2],[9,3,9,4],[9,5,9,6],[9,7,9,8],[9,9,9,10],[9,11,9,12],[9,13,9,14],[9,15,9,16],[9,17,9,18],[9,19,9,20],[9,21,9,22],[9,23,9,24],[9,25,9,26],[9,27,9,28],[9,29,9,30],[10,1,10,2],[10,3,10,4],[10,5,10,6],[10,7,10,8],[10,9,10,10],[10,11,10,12],[10,13,10,14],[10,15,10,16],[10,17,10,18],[10,19,10,20],[10,21,10,22],[10,23,10,24],[10,25,10,26],[10,27,10,28],[10,29,10,30],[11,1,11,2],[11,3,11,4],[11,5,11,6],[11,7,11,8],[11,9,11,10],[11,11,11,12],[11,13,11,14],[11,15,11,16],[11,17,11,18],[11,19,11,20],[11,21,11,22],[11,23,11,24],[11,25,11,26],[11,27,11,28],[11,29,11,30],[12,1,12,2],[12,3,12,4],[12,5,12,6],[12,7,12,8],[12,9,12,10],[12,11,12,12],[12,13,12,14],[12,15,12,16],[12,17,12,18],[12,19,12,20],[12,21,12,22],[12,23,12,24],[12,25,12,26],[12,27,12,28],[12,29,12,30],[13,1,13,2],[13,3,13,4],[13,5,13,6],[13,7,13,8],[13,9,13,10],[13,11,13,12],[13,13,13,14],[13,15,13,16],[13,17,13,18],[13,19,13,20],[13,21,13,22],[13,23,13,24],[13,25,13,26],[13,27,13,28],[13,29,13,30],[14,1,14,24],[14,25,14,26],[14,27,14,28],[14,29,14,30],[15,44,15,45],[17,11,19,12],[17,13,18,16],[17,17,19,18],[17,19,19,20],[17,21,19,22],[17,23,17,28],[17,29,19,30],[18,23,19,24],[18,25,19,26],[18,27,19,28],[18,34,18,35],[18,44,18,45],[19,13,19,14],[19,15,19,16],[20,11,20,12],[20,13,20,14],[20,15,20,16],[20,17,20,18],[20,19,20,20],[20,21,20,22],[20,23,20,24],[20,25,20,26],[20,27,20,28],[20,29,20,30],[21,11,21,12],[21,13,21,14],[21,15,21,16],[21,17,21,18],[21,19,21,20],[21,21,21,22],[21,23,21,24],[21,25,21,26],[21,27,21,28],[21,29,21,30],[22,11,22,24],[22,25,22,26],[22,27,22,28],[22,29,22,30],[25,11,27,12],[25,13,27,14],[25,15,27,16],[25,17,27,18],[25,19,27,20],[25,21,27,22],[25,23,25,28],[25,29,27,30],[26,23,27,24],[26,25,27,26],[26,27,27,28],[26,34,26,35],[28,11,28,12],[28,13,28,14],[28,15,28,16],[28,17,28,18],[28,19,28,20],[28,21,28,22],[28,23,28,24],[28,25,28,26],[28,27,28,28],[28,29,28,30],[29,11,29,12],[29,13,29,14],[29,15,29,16],[29,17,29,18],[29,19,29,20],[29,21,29,22],[29,23,29,24],[29,25,29,26],[29,27,29,28],[29,29,29,30],[30,11,30,12],[30,13,30,14],[30,15,30,16],[30,17,30,18],[30,19,30,20],[30,21,30,22],[30,23,30,24],[30,25,30,26],[30,27,30,28],[30,29,30,30],[31,11,31,12],[31,13,31,14],[31,15,31,16],[31,17,31,18],[31,19,31,20],[31,21,31,22],[31,23,31,24],[31,25,31,26],[31,27,31,28],[31,29,31,30],[32,11,32,12],[32,13,32,14],[32,15,32,16],[32,17,32,18],[32,19,32,20],[32,21,32,22],[32,23,32,24],[32,25,32,26],[32,27,32,28],[32,29,32,30],[33,11,33,24],[33,25,33,26],[33,27,33,28],[33,29,33,30],[36,11,38,12],[36,13,37,18],[36,19,38,22],[36,23,38,26],[36,27,38,30],[38,13,38,15],[38,16,38,18],[39,11,39,12],[39,13,39,15],[39,16,39,18],[39,19,39,22],[39,23,39,26],[39,27,39,30],[40,11,40,12],[40,13,40,15],[40,16,40,18],[40,19,40,22],[40,23,40,26],[40,27,40,30],[41,11,41,26],[41,27,41,30],[44,1,47,2],[44,9,44,11],[44,14,44,15],[44,18,44,19],[44,22,44,23],[44,28,44,29],[45,26,45,28],[45,29,45,30],[46,26,46,28],[46,29,46,30],[47,26,47,28]]}
[]
[null,"内訳計算シートＡ　　＜北西面＞ の外皮熱損失量と日射熱取得量",{"$nulls":31},"規約"]
[{"$nulls":33},{"$f":"共通条件・結果!AH3","v":1}]
[null,"1）窓の入力",{"$nulls":19},"方位係数",{"$nulls":3},{"$f":"IF(共通条件・結果!AA7=\"８地域\",\"0.411\",IF(共通条件・結果!AA7=\"７地域\",0.406,IF(共通条件・結果!AA7=\"６地域\",0.427,IF(共通条件・結果!AA7=\"５地域\",0.442,IF(共通条件・結果!AA7=\"４地域\",0.401,IF(共通条件・結果!AA7=\"３地域\",0.447,IF(共通条件・結果!AA7=\"２地域\",0.428,IF(共通条件・結果!AA7=\"１地域\",0.411))))))))","v":0.447},null,{"$f":"IF(共通条件・結果!AA7=\"８地域\",\"-\",IF(共通条件・結果!AA7=\"７地域\",0.284,IF(共通条件・結果!AA7=\"６地域\",0.317,IF(共通条件・結果!AA7=\"５地域\",0.297,IF(共通条件・結果!AA7=\"４地域\",0.326,IF(共通条件・結果!AA7=\"３地域\",0.351,IF(共通条件・結果!AA7=\"２地域\",0.341,IF(共通条件・結果!AA7=\"１地域\",0.325))))))))","v":0.351}]
[null,"窓番号",null,"寸法[ｍ]",{"$nulls":3},"熱貫流率\n[W/(㎡･K)]",null,"日射熱取得",{"$nulls":3},"付属部材\nの有無",null,"温度差\n係数",null,"取得日射量補正係数の算出",{"$nulls":7},"冷房期\n日射熱\n取得量\n[W/(W/㎡)]",null,"暖房期\n日射熱\n取得量\n[W/(W/㎡)]",null,"熱損失\n[W/K]"]
[{"$nulls":3},"幅",null,"高さ",{"$nulls":3},"加算の\n必要性",null,"日射熱\n取得率\n※1",{"$nulls":5},"ﾃﾞﾌｫﾙﾄ\n値使用",null,"庇による補正計算[ｍ]",{"$nulls":14},"日射熱取得量",{"$nulls":3},"取得日射量補正係数",null,null,"取得日射量補正係数(FALSEの場合)",null,null,"補正熱貫流率"]
[{"$nulls":19},"Z",null,"ｙ1",null,"ｙ2",{"$nulls":9},"日射の有無","冷房期","暖房期",null,null,"冷房期","暖房期",null,"冷房期","暖房期",null,"Ui","⊿R"]
[{"$nulls":25},{"$f":"IF(D8=\"\",\"\",AI8)","v":""},null,{"$f":"IF(D8=\"\",\"\",IF(ISERROR(AJ8),\"-\",AJ8))","v":""},null,{"$f":"IF(D8=\"\",\"\",D8*F8*AS8*P8)","v":""},{"$nulls":3},true,{"$f":"IF(AH8=FALSE,\"0.0\",D8*F8*L8*$Z$4*AM8)","v":0},{"$f":"IF(AH8=FALSE,\"0.0\",D8*F8*L8*$AB$4*AN8)","v":0},null,true,{"$f":"IF(AL8=TRUE,\"0.93\",IF(ISERROR(AP8),\"エラー\",IF(AP8>0.93,\"0.93\",AP8)))","v":"0.93"},{"$f":"IF(AL8=TRUE,\"0.51\",IF(ISERROR(AQ8),\"エラー\",IF(AQ8>0.72,\"0.72\",AQ8)))","v":"0.51"},null,{"$f":"0.01*(16+24*(2*V8+X8)/T8)","v":{"$error":"#DIV/0!"}},{"$f":"0.01*(10+15*(2*V8+X8)/T8)","v":{"$error":"#DIV/0!"}},null,{"$f":"IF(AT8=\"FALSE\",H8,IF(N8=\"風除室\",1/((1/H8)+0.1),0.5*H8+0.5*(1/((1/H8)+AT8))))","v":0},{"$f":"IF(N8=\"\",\"FALSE\",IF(N8=\"雨戸\",0.1,IF(N8=\"ｼｬｯﾀｰ\",0.1,IF(N8=\"障子\",0.18,IF(N8=\"風除室\",0.1)))))","v":"FALSE"}]
[{"$nulls":25},"",null,"",null,"",{"$nulls":3},true,0,0,null,true,{"$f":"IF(AL9=TRUE,\"0.93\",IF(ISERROR(AP9),\"エラー\",IF(AP9>0.93,\"0.93\",AP9)))","v":"0.93"},{"$f":"IF(AL9=TRUE,\"0.51\",IF(ISERROR(AQ9),\"エラー\",IF(AQ9>0.72,\"0.72\",AQ9)))","v":"0.51"},null,{"$error":"#DIV/0!"},{"$error":"#DIV/0!"},null,{"$f":"IF(AT9=\"FALSE\",H9,IF(N9=\"風除室\",1/((1/H9)+0.1),0.5*H9+0.5*(1/((1/H9)+AT9))))","v":0},"FALSE"]
[{"$nulls":25},"",null,"",null,"",{"$nulls":3},true,0,0,null,true,"0.93","0.51",null,{"$error":"#DIV/0!"},{"$error":"#DIV/0!"},null,0,"FALSE"]
[{"$nulls":25},"",null,"",null,"",{"$nulls":3},true,0,0,null,true,"0.93","0.51",null,{"$error":"#DIV/0!"},{"$error":"#DIV/0!"},null,0,"FALSE"]
[{"$nulls":25},"",null,"",null,"",{"$nulls":3},true,0,0,null,true,"0.93","0.51",null,{"$error":"#DIV/0!"},{"$error":"#DIV/0!"},null,0,"FALSE"]
[{"$nulls":25},"",null,"",null,"",{"$nulls":3},true,0,0,null,true,"0.93","0.51",null,{"$error":"#DIV/0!"},{"$error":"#DIV/0!"},null,0,"FALSE"]
[{"$nulls":25},"",null,"",null,"",{"$nulls":3},true,0,0,null,true,"0.93","0.51",null,{"$error":"#DIV/0!"},{"$error":"#DIV/0!"},null,0,"FALSE"]
[null,"窓 ＜北西面＞ 各値合計",{"$nulls":23},{"$f":"SUM(Z8:AA14)","v":{"v":0,"d":"0.00"}},null,{"$f":"IF(共通条件・結果!AA7=\"８地域\",\"-\",SUM(AB8:AC14))","v":{"v":0,"d":"0.00"}},null,{"$f":"SUM(AD8:AE14)","v":{"v":0,"d":"0.00"}}]
[]
[{"$nulls":11},"2）ドアの入力"]
[{"$nulls":11},"ドア番号",null,"寸法[ｍ]",{"$nulls":3},"熱貫流率\n[W/(㎡･K)]",null,"付属部材\nの有無",null,"温度差\n係数",null,"日射熱取得[W/(W/㎡)]",{"$nulls":5},"熱損失\n[W/K]"]
[{"$nulls":23},"加算の\n必要性",null,"冷房期\n日射熱\n取得量",null,"暖房期\n日射熱\n取得量",{"$nulls":6},"日射熱取得量",{"$nulls":9},"補正熱貫流率"]
[{"$nulls":13},"幅",null,"高さ",{"$nulls":17},"日射の有無","冷房期","暖房期",{"$nulls":8},"Ui","⊿R"]
[{"$nulls":25},{"$f":"IF(N21=\"\",\"\",AI21)","v":""},null,{"$f":"IF(N21=\"\",\"\",IF(ISERROR(AJ21),\"-\",AJ21))","v":""},null,{"$f":"IF(N21=\"\",\"\",N21*P21*AS21*V21)","v":""},{"$nulls":3},true,{"$f":"IF(AH21=FALSE,\"0.0\",IF(AH21=TRUE,N21*P21*R21*0.034*$Z$4,\"-\"))","v":0},{"$f":"IF(AH21=FALSE,\"0.0\",IF(ISERROR(N21*P21*R21*0.034*$AB$4),\"-\",N21*P21*R21*0.034*$AB$4))","v":0},{"$nulls":8},{"$f":"IF(AT21=\"FALSE\",R21,IF(T21=\"風除室\",1/((1/R21)+0.1),0.5*R21+0.5*(1/((1/R21)+AT21))))","v":0},{"$f":"IF(T21=\"\",\"FALSE\",IF(T21=\"雨戸\",0.1,IF(T21=\"ｼｬｯﾀｰ\",0.1,IF(T21=\"障子\",0.18,IF(T21=\"風除室\",0.1)))))","v":"FALSE"}]
[{"$nulls":25},{"$f":"IF(N22=\"\",\"\",AI22)","v":""},null,{"$f":"IF(N22=\"\",\"\",IF(ISERROR(AJ22),\"-\",AJ22))","v":""},null,{"$f":"IF(N22=\"\",\"\",N22*P22*AS22*V22)","v":""},{"$nulls":3},true,{"$f":"IF(AH22=FALSE,\"0.0\",IF(AH22=TRUE,N22*P22*R22*0.034*$Z$4,\"-\"))","v":0},{"$f":"IF(AH22=FALSE,\"0.0\",IF(ISERROR(N22*P22*R22*0.034*$AB$4),\"-\",N22*P22*R22*0.034*$AB$4))","v":0},{"$nulls":8},{"$f":"IF(AT22=\"FALSE\",R22,IF(T22=\"風除室\",1/((1/R22)+0.1),0.5*R22+0.5*(1/((1/R22)+AT22))))","v":0},{"$f":"IF(T22=\"\",\"FALSE\",IF(T22=\"雨戸\",0.1,IF(T22=\"ｼｬｯﾀｰ\",0.1,IF(T22=\"障子\",0.18,IF(T22=\"風除室\",0.1)))))","v":"FALSE"}]
[{"$nulls":11},"　ドア ＜北西面＞ 各値合計",{"$nulls":13},{"$f":"SUM(Z21:AA22)","v":{"v":0,"d":"0.00"}},null,{"$f":"SUM(AB21:AC22)","v":{"v":0,"d":"0.00"}},null,{"$f":"SUM(AD21:AE22)","v":{"v":0,"d":"0.00"}}]
[]
[{"$nulls":11},"3）外壁・界壁等の入力"]
[{"$nulls":11},"仕様番号",null,"外壁\n面積\n[㎡]",null,"除外窓\n等面積\n[㎡]",null,"計算対象\n外壁面積[㎡]",null,"熱貫流率\n[W/(㎡･K)]",null,"温度差\n係数",null,"日射熱取得[W/(W/㎡)]",{"$nulls":5},"熱損失\n[W/K]"]
[{"$nulls":23},"加算の\n必要性",null,"冷房期\n日射熱\n取得量",null,"暖房期\n日射熱\n取得量",{"$nulls":6},"日射熱取得量"]
[{"$nulls":33},"日射の有無","冷房期","暖房期"]
[{"$nulls":17},{"$f":"IF(N29=\"\",\"\",N29-P29)","v":""},{"$nulls":7},{"$f":"IF(N29=\"\",\"\",AI29)","v":""},null,{"$f":"IF(N29=\"\",\"\",AJ29)","v":""},null,{"$f":"IF(N29=\"\",\"\",R29*T29*V29)","v":""},{"$nulls":3},true,{"$f":"IF(AH29=FALSE,\"0.0\",IF(AH29=TRUE,R29*T29*0.034*$Z$4,\"-\"))","v":{"$error":"#VALUE!"}},{"$f":"IF(AH29=FALSE,\"0.0\",IF(ISERROR(R29*T29*0.034*$AB$4),\"-\",R29*T29*0.034*$AB$4))","v":"-"}]
[{"$nulls":17},{"$f":"IF(N30=\"\",\"\",N30-P30)","v":""},{"$nulls":7},{"$f":"IF(N30=\"\",\"\",AI30)","v":""},null,{"$f":"IF(N30=\"\",\"\",AJ30)","v":""},null,{"$f":"IF(N30=\"\",\"\",R30*T30*V30)","v":""},{"$nulls":3},true,{"$f":"IF(AH30=FALSE,\"0.0\",IF(AH30=TRUE,R30*T30*0.034*$Z$4,\"-\"))","v":{"$error":"#VALUE!"}},{"$f":"IF(AH30=FALSE,\"0.0\",IF(ISERROR(R30*T30*0.034*$AB$4),\"-\",R30*T30*0.034*$AB$4))","v":"-"}]
[{"$nulls":17},{"$f":"IF(N31=\"\",\"\",N31-P31)","v":""},{"$nulls":7},{"$f":"IF(N31=\"\",\"\",AI31)","v":""},null,{"$f":"IF(N31=\"\",\"\",AJ31)","v":""},null,{"$f":"IF(N31=\"\",\"\",R31*T31*V31)","v":""},{"$nulls":3},true,{"$f":"IF(AH31=FALSE,\"0.0\",IF(AH31=TRUE,R31*T31*0.034*$Z$4,\"-\"))","v":{"$error":"#VALUE!"}},{"$f":"IF(AH31=FALSE,\"0.0\",IF(ISERROR(R31*T31*0.034*$AB$4),\"-\",R31*T31*0.034*$AB$4))","v":"-"}]
[{"$nulls":17},{"$f":"IF(N32=\"\",\"\",N32-P32)","v":""},{"$nulls":7},{"$f":"IF(N32=\"\",\"\",AI32)","v":""},null,{"$f":"IF(N32=\"\",\"\",AJ32)","v":""},null,{"$f":"IF(N32=\"\",\"\",R32*T32*V32)","v":""},{"$nulls":3},true,{"$f":"IF(AH32=FALSE,\"0.0\",IF(AH32=TRUE,R32*T32*0.034*$Z$4,\"-\"))","v":{"$error":"#VALUE!"}},{"$f":"IF(AH32=FALSE,\"0.0\",IF(ISERROR(R32*T32*0.034*$AB$4),\"-\",R32*T32*0.034*$AB$4))","v":"-"}]
[{"$nulls":17},{"$f":"IF(N33=\"\",\"\",N33-P33)","v":""},{"$nulls":7},{"$f":"IF(N33=\"\",\"\",AI33)","v":""},null,{"$f":"IF(N33=\"\",\"\",AJ33)","v":""},null,{"$f":"IF(N33=\"\",\"\",R33*T33*V33)","v":""},{"$nulls":3},true,{"$f":"IF(AH33=FALSE,\"0.0\",IF(AH33=TRUE,R33*T33*0.034*$Z$4,\"-\"))","v":{"$error":"#VALUE!"}},{"$f":"IF(AH33=FALSE,\"0.0\",IF(ISERROR(R33*T33*0.034*$AB$4),\"-\",R33*T33*0.034*$AB$4))","v":"-"}]
[{"$nulls":11},"外壁・界壁等 ＜北西面＞ 各値合計",{"$nulls":13},{"$f":"SUM(Z29:AA33)","v":{"v":0,"d":"0.00"}},null,{"$f":"IF(共通条件・結果!AA7=\"８地域\",\"-\",SUM(AB29:AC33))","v":{"v":0,"d":"0.00"}},null,{"$f":"SUM(AD29:AE33)","v":{"v":0,"d":"0.00"}}]
[{"$nulls":11},"※基礎壁は、こちらに入力してください。"]
[{"$nulls":11},"4）隣接空間に通ずる開口部の入力"]
[{"$nulls":11},"開口部\n番号",null,"寸法[ｍ]",{"$nulls":5},"熱貫流率\n[W/(㎡･K)]",{"$nulls":3},"温度差\n係数",{"$nulls":3},"熱損失\n[W/K]"]
[]
[{"$nulls":13},"幅",null,null,"高さ"]
[{"$nulls":27},{"$f":"IF(N40=\"\",\"\",N40*Q40*T40*X40)","v":""}]
[{"$nulls":27},{"$f":"IF(N41=\"\",\"\",N41*Q41*T41*X41)","v":""}]
[{"$nulls":11},"隣接空間に通ずる開口部 ＜北西面＞ 各値合計",{"$nulls":15},{"$f":"SUM(AB40:AB41)","v":{"v":0,"d":"0.00"}}]
[]
[null,"5）住宅 ＜北西面＞ 計算結果"]
[null,"北西面",null,"　外皮等面積（内訳）",{"$nulls":5},{"$f":"$O45+$S$45+$W$45+$AC$45","v":{"v":0,"d":"0.00"}},null,null,"㎡","（窓",{"$f":"$D$8*$F$8+$D$9*$F$9+$D$10*$F$10+$D$11*$F$11+$D$12*$F$12+$D$13*$F$13+$D$14*$F$14","v":0},null,"㎡、ドア",null,{"$f":"$N$21*$P$21+$N$22*$P$22","v":0},null,"㎡、外壁",null,{"$f":"SUM($R$29:$S$33)","v":0},null,"㎡、その他開口部",{"$nulls":3},{"$f":"$N$40*$Q$40+$N$41*$Q$41","v":0},null,"㎡）"]
[{"$nulls":3},"　冷房期総日射熱取得量",{"$nulls":22},{"$f":"$Z$15+$Z$23+$Z$34","v":{"v":0,"d":"0.00"}},null,null,"[W/(W/㎡)]"]
[{"$nulls":3},"　暖房期総日射熱取得量",{"$nulls":22},{"$f":"IF(共通条件・結果!AA7=\"８地域\",\"-\",$AB$15+$AB$23+$AB$34)","v":{"v":0,"d":"0.00"}},null,null,"[W/(W/㎡)]"]
[{"$nulls":3},"　総熱損失",{"$nulls":22},{"$f":"$AD$15+$AD$23+$AD$34+$AB$42","v":{"v":0,"d":"0.00"}},null,null,"W/K"]

{"sheet":"Ｂ（熱橋部）","index":9,"n_rows":49,"n_cols":48,"rows_kept":49,"merged":[[1,1,1,31],[3,1,5,2],[3,3,5,4],[3,5,5,6],[3,7,5,8],[3,9,5,10],[3,11,5,12],[3,13,5,14],[3,15,3,18],[3,19,5,20],[3,21,5,22],[3,23,5,24],[3,25,5,31],[4,15,5,16],[4,17,5,18],[4,39,5,39],[4,40,4,47],[6,1,10,2],[6,3,6,4],[6,5,6,6],[6,7,6,8],[6,9,6,10],[6,11,6,12],[6,13,6,14],[6,15,6,16],[6,17,6,18],[6,19,6,20],[6,21,6,22],[6,23,6,24],[6,25,6,31],[6,40,7,47],[7,3,7,4],[7,5,7,6],[7,7,7,8],[7,9,7,10],[7,11,7,12],[7,13,7,14],[7,15,7,16],[7,17,7,18],[7,19,7,20],[7,21,7,22],[7,23,7,24],[7,25,7,31],[8,3,8,4],[8,5,8,6],[8,7,8,8],[8,9,8,10],[8,11,8,12],[8,13,8,14],[8,15,8,16],[8,17,8,18],[8,19,8,20],[8,21,8,22],[8,23,8,24],[8,25,8,31],[9,3,9,4],[9,5,9,6],[9,7,9,8],[9,9,9,10],[9,11,9,12],[9,13,9,14],[9,15,9,16],[9,17,9,18],[9,19,9,20],[9,21,9,22],[9,23,9,24],[9,25,9,31],[10,3,10,4],[10,5,10,6],[10,7,10,8],[10,9,10,10],[10,11,10,12],[10,13,10,14],[10,15,10,16],[10,17,10,18],[10,19,10,20],[10,21,10,22],[10,23,10,24],[10,25,10,31],[11,1,15,2],[11,3,11,4],[11,5,11,6],[11,7,11,8],[11,9,11,10],[11,11,11,12],[11,13,11,14],[11,15,11,16],[11,17,11,18],[11,19,11,20],[11,21,11,22],[11,23,11,24],[11,25,11,31],[12,3,12,4],[12,5,12,6],[12,7,12,8],[12,9,12,10],[12,11,12,12],[12,13,12,14],[12,15,12,16],[12,17,12,18],[12,19,12,20],[12,21,12,22],[12,23,12,24],[12,25,12,31],[13,3,13,4],[13,5,13,6],[13,7,13,8],[13,9,13,10],[13,11,13,12],[13,13,13,14],[13,15,13,16],[13,17,13,18],[13,19,13,20],[13,21,13,22],[13,23,13,24],[13,25,13,31],[14,3,14,4],[14,5,14,6],[14,7,14,8],[14,9,14,10],[14,11,14,12],[14,13,14,14],[14,15,14,16],[14,17,14,18],[14,19,14,20],[14,21,14,22],[14,23,14,24],[14,25,14,31],[15,3,15,4],[15,5,15,6],[15,7,15,8],[15,9,15,10],[15,11,15,12],[15,13,15,14],[15,15,15,16],[15,17,15,18],[15,19,15,20],[15,21,15,22],[15,23,15,24],[15,25,15,31],[16,1,20,2],[16,3,16,4],[16,5,16,6],[16,7,16,8],[16,9,16,10],[16,11,16,12],[16,13,16,14],[16,15,16,16],[16,17,16,18],[16,19,16,20],[16,21,16,22],[16,23,16,24],[16,25,16,31],[16,40,18,47],[17,3,17,4],[17,5,17,6],[17,7,17,8],[17,9,17,10],[17,11,17,12],[17,13,17,14],[17,15,17,16],[17,17,17,18],[17,19,17,20],[17,21,17,22],[17,23,17,24],[17,25,17,31],[18,3,18,4],[18,5,18,6],[18,7,18,8],[18,9,18,10],[18,11,18,12],[18,13,18,14],[18,15,18,16],[18,17,18,18],[18,19,18,20],[18,21,18,22],[18,23,18,24],[18,25,18,31],[19,3,19,4],[19,5,19,6],[19,7,19,8],[19,9,19,10],[19,11,19,12],[19,13,19,14],[19,15,19,16],[19,17,19,18],[19,19,19,20],[19,21,19,22],[19,23,19,24],[19,25,19,31],[20,3,20,4],[20,5,20,6],[20,7,20,8],[20,9,20,10],[20,11,20,12],[20,13,20,14],[20,15,20,16],[20,17,20,18],[20,19,20,20],[20,21,20,22],[20,23,20,24],[20,25,20,31],[21,1,25,2],[21,3,21,4],[21,5,21,6],[21,7,21,8],[21,9,21,10],[21,11,21,12],[21,13,21,14],[21,15,21,16],[21,17,21,18],[21,19,21,20],[21,21,21,22],[21,23,21,24],[21,25,21,31],[22,3,22,4],[22,5,22,6],[22,7,22,8],[22,9,22,10],[22,11,22,12],[22,13,22,14],[22,15,22,16],[22,17,22,18],[22,19,22,20],[22,21,22,22],[22,23,22,24],[22,25,22,31],[22,39,23,39],[22,40,22,47],[23,3,23,4],[23,5,23,6],[23,7,23,8],[23,9,23,10],[23,11,23,12],[23,13,23,14],[23,15,23,16],[23,17,23,18],[23,19,23,20],[23,21,23,22],[23,23,23,24],[23,25,23,31],[24,3,24,4],[24,5,24,6],[24,7,24,8],[24,9,24,10],[24,11,24,12],[24,13,24,14],[24,15,24,16],[24,17,24,18],[24,19,24,20],[24,21,24,22],[24,23,24,24],[24,25,24,31],[24,40,25,47],[25,3,25,4],[25,5,25,6],[25,7,25,8],[25,9,25,10],[25,11,25,12],[25,13,25,14],[25,15,25,16],[25,17,25,18],[25,19,25,20],[25,21,25,22],[25,23,25,24],[25,25,25,31],[26,1,30,2],[26,3,26,4],[26,5,26,6],[26,7,26,8],[26,9,26,10],[26,11,26,12],[26,13,26,14],[26,15,26,16],[26,17,26,18],[26,19,26,20],[26,21,26,22],[26,23,26,24],[26,25,26,31],[27,3,27,4],[27,5,27,6],[27,7,27,8],[27,9,27,10],[27,11,27,12],[27,13,27,14],[27,15,27,16],[27,17,27,18],[27,19,27,20],[27,21,27,22],[27,23,27,24],[27,25,27,31],[28,3,28,4],[28,5,28,6],[28,7,28,8],[28,9,28,10],[28,11,28,12],[28,13,28,14],[28,15,28,16],[28,17,28,18],[28,19,28,20],[28,21,28,22],[28,23,28,24],[28,25,28,31],[29,3,29,4],[29,5,29,6],[29,7,29,8],[29,9,29,10],[29,11,29,12],[29,13,29,14],[29,15,29,16],[29,17,29,18],[29,19,29,20],[29,21,29,22],[29,23,29,24],[29,25,29,31],[30,3,30,4],[30,5,30,6],[30,7,30,8],[30,9,30,10],[30,11,30,12],[30,13,30,14],[30,15,30,16],[30,17,30,18],[30,19,30,20],[30,21,30,22],[30,23,30,24],[30,25,30,31],[31,1,35,2],[31,3,31,4],[31,5,31,6],[31,7,31,8],[31,9,31,10],[31,11,31,12],[31,13,31,14],[31,15,31,16],[31,17,31,18],[31,19,31,20],[31,21,31,22],[31,23,31,24],[31,25,31,31],[32,3,32,4],[32,5,32,6],[32,7,32,8],[32,9,32,10],[32,11,32,12],[32,13,32,14],[32,15,32,16],[32,17,32,18],[32,19,32,20],[32,21,32,22],[32,23,32,24],[32,25,32,31],[33,3,33,4],[33,5,33,6],[33,7,33,8],[33,9,33,10],[33,11,33,12],[33,13,33,14],[33,15,33,16],[33,17,33,18],[33,19,33,20],[33,21,33,22],[33,23,33,24],[33,25,33,31],[34,3,34,4],[34,5,34,6],[34,7,34,8],[34,9,34,10],[34,11,34,12],[34,13,34,14],[34,15,34,16],[34,17,34,18],[34,19,34,20],[34,21,34,22],[34,23,34,24],[34,25,34,31],[34,40,36,47],[35,3,35,4],[35,5,35,6],[35,7,35,8],[35,9,35,10],[35,11,35,12],[35,13,35,14],[35,15,35,16],[35,17,35,18],[35,19,35,20],[35,21,35,22],[35,23,35,24],[35,25,35,31],[38,1,40,2],[38,28,38,29],[38,30,38,31],[39,28,39,29],[39,30,39,31],[40,28,40,29]]}
[]
[null,"内訳計算シートＢ　　＜構造熱橋部＞ の外皮熱損失量と日射熱取得量",{"$nulls":31},"規約"]
[null,"1）構造熱橋部の入力",{"$nulls":31},{"$f":"共通条件・結果!AH3","v":1}]
[null,"方位",null,"部位",null,"熱橋\n長さ\n[ｍ]",null,"線熱貫流率\n[W/(m･K)]",null,"温度差係数",null,"共有する\n住戸数",null,"日射熱\n取得の\n加算",null,"方位係数",{"$nulls":3},"冷房期\n日射熱\n取得量\n[W/(W/㎡)]",null,"暖房期\n日射熱\n取得量\n[W/(W/㎡)]",null,"熱損失\n[W/K]",null,"備考欄",{"$nulls":13},"冷房期"]
[{"$nulls":15},"冷房期",null,"暖房期",{"$nulls":18},"方位係数",null,null,"方位","地域区分"]
[{"$nulls":34},"日射の有無",null,"冷房期","暖房期",null,null,"１（Ⅰa）","２（Ⅰb）","３（Ⅱ）","４（Ⅲ）","５（Ⅳa）","６（Ⅳb）","７（Ⅴ）","８（Ⅵ）"]
[{"$nulls":15},{"$f":"IF(OR($B$7=\"\",F7=\"\"),\"\",IF(OR(D7=\"屋根\",D7=\"天井\"),1,IF(OR(D7=\"ピット等\",D7=\"その他床\",D7=\"外気床\"),0,VLOOKUP($B$7,$AJ$7:$AL$14,2,0))))","v":""},null,{"$f":"IF(OR($B$7=\"\",F7=\"\"),\"\",IF(OR(D7=\"屋根\",D7=\"天井\"),1,IF(OR(D7=\"ピット等\",D7=\"その他床\",D7=\"外気床\"),0,VLOOKUP($B$7,$AJ$7:$AL$14,3,0))))","v":""},null,{"$f":"IF(F7=\"\",\"\",IF(AI7=FALSE,\"0.0\",F7*H7*0.034*P7/L7))","v":""},null,{"$f":"IF(ISERROR(R7/L7),\"-\",IF(F7=\"\",\"\",IF(AI7=FALSE,\"0.0\",F7*H7*0.034*R7/L7)))","v":"-"},null,{"$f":"IF(F7=\"\",\"\",F7*H7*J7/L7)","v":""},{"$nulls":10},true,"北",{"$f":"IF(共通条件・結果!AA7=\"８地域\",\"0.325\",IF(共通条件・結果!AA7=\"７地域\",0.307,IF(共通条件・結果!AA7=\"６地域\",0.341,IF(共通条件・結果!AA7=\"５地域\",0.373,IF(共通条件・結果!AA7=\"４地域\",0.322,IF(共通条件・結果!AA7=\"３地域\",0.335,IF(共通条件・結果!AA7=\"２地域\",0.341,IF(共通条件・結果!AA7=\"１地域\",0.329))))))))","v":0.335},{"$f":"IF(共通条件・結果!AA7=\"８地域\",\"-\",IF(共通条件・結果!AA7=\"７地域\",0.227,IF(共通条件・結果!AA7=\"６地域\",0.261,IF(共通条件・結果!AA7=\"５地域\",0.238,IF(共通条件・結果!AA7=\"４地域\",0.256,IF(共通条件・結果!AA7=\"３地域\",0.284,IF(共通条件・結果!AA7=\"２地域\",0.263,IF(共通条件・結果!AA7=\"１地域\",0.26))))))))","v":0.284},null,"屋根",{"v":1,"d":"1.00"}]
[{"$nulls":15},{"$f":"IF(OR($B$7=\"\",F8=\"\"),\"\",IF(OR(D8=\"屋根\",D8=\"天井\"),1,IF(OR(D8=\"ピット等\",D8=\"その他床\",D8=\"外気床\"),0,VLOOKUP($B$7,$AJ$7:$AL$14,2,0))))","v":""},null,{"$f":"IF(OR($B$7=\"\",F8=\"\"),\"\",IF(OR(D8=\"屋根\",D8=\"天井\"),1,IF(OR(D8=\"ピット等\",D8=\"その他床\",D8=\"外気床\"),0,VLOOKUP($B$7,$AJ$7:$AL$14,3,0))))","v":""},null,"",null,{"$f":"IF(ISERROR(R8/L8),\"-\",IF(F8=\"\",\"\",IF(AI8=FALSE,\"0.0\",F8*H8*0.034*R8/L8)))","v":"-"},null,"",{"$nulls":10},true,"北東",{"$f":"IF(共通条件・結果!AA7=\"８地域\",\"0.414\",IF(共通条件・結果!AA7=\"７地域\",0.415,IF(共通条件・結果!AA7=\"６地域\",0.431,IF(共通条件・結果!AA7=\"５地域\",0.437,IF(共通条件・結果!AA7=\"４地域\",0.426,IF(共通条件・結果!AA7=\"３地域\",0.39,IF(共通条件・結果!AA7=\"２地域\",0.412,IF(共通条件・結果!AA7=\"１地域\",0.43))))))))","v":{"v":0.39,"d":"0.390"}},{"$f":"IF(共通条件・結果!AA7=\"８地域\",\"-\",IF(共通条件・結果!AA7=\"７地域\",0.281,IF(共通条件・結果!AA7=\"６地域\",0.325,IF(共通条件・結果!AA7=\"５地域\",0.31,IF(共通条件・結果!AA7=\"４地域\",0.33,IF(共通条件・結果!AA7=\"３地域\",0.348,IF(共通条件・結果!AA7=\"２地域\",0.341,IF(共通条件・結果!AA7=\"１地域\",0.333))))))))","v":0.348},null,"天井"]
[{"$nulls":15},{"$f":"IF(OR($B$7=\"\",F9=\"\"),\"\",IF(OR(D9=\"屋根\",D9=\"天井\"),1,IF(OR(D9=\"ピット等\",D9=\"その他床\",D9=\"外気床\"),0,VLOOKUP($B$7,$AJ$7:$AL$14,2,0))))","v":""},null,{"$f":"IF(OR($B$7=\"\",F9=\"\"),\"\",IF(OR(D9=\"屋根\",D9=\"天井\"),1,IF(OR(D9=\"ピット等\",D9=\"その他床\",D9=\"外気床\"),0,VLOOKUP($B$7,$AJ$7:$AL$14,3,0))))","v":""},null,"",null,{"$f":"IF(ISERROR(R9/L9),\"-\",IF(F9=\"\",\"\",IF(AI9=FALSE,\"0.0\",F9*H9*0.034*R9/L9)))","v":"-"},null,"",{"$nulls":10},true,"東",{"$f":"IF(共通条件・結果!AA7=\"８地域\",\"0.515\",IF(共通条件・結果!AA7=\"７地域\",0.509,IF(共通条件・結果!AA7=\"６地域\",0.512,IF(共通条件・結果!AA7=\"５地域\",0.5,IF(共通条件・結果!AA7=\"４地域\",0.518,IF(共通条件・結果!AA7=\"３地域\",0.468,IF(共通条件・結果!AA7=\"２地域\",0.503,IF(共通条件・結果!AA7=\"１地域\",0.545))))))))","v":0.468},{"$f":"IF(共通条件・結果!AA7=\"８地域\",\"-\",IF(共通条件・結果!AA7=\"７地域\",0.543,IF(共通条件・結果!AA7=\"６地域\",0.579,IF(共通条件・結果!AA7=\"５地域\",0.568,IF(共通条件・結果!AA7=\"４地域\",0.531,IF(共通条件・結果!AA7=\"３地域\",0.54,IF(共通条件・結果!AA7=\"２地域\",0.554,IF(共通条件・結果!AA7=\"１地域\",0.564))))))))","v":{"v":0.54,"d":"0.540"}},null,"壁（北）",0.329,0.341,0.335,0.322,0.373,0.341,0.307,0.325]
[{"$nulls":15},{"$f":"IF(OR($B$7=\"\",F10=\"\"),\"\",IF(OR(D10=\"屋根\",D10=\"天井\"),1,IF(OR(D10=\"ピット等\",D10=\"その他床\",D10=\"外気床\"),0,VLOOKUP($B$7,$AJ$7:$AL$14,2,0))))","v":""},null,{"$f":"IF(OR($B$7=\"\",F10=\"\"),\"\",IF(OR(D10=\"屋根\",D10=\"天井\"),1,IF(OR(D10=\"ピット等\",D10=\"その他床\",D10=\"外気床\"),0,VLOOKUP($B$7,$AJ$7:$AL$14,3,0))))","v":""},null,"",null,"-",null,"",{"$nulls":10},true,"南東",{"$f":"IF(共通条件・結果!AA7=\"８地域\",\"0.528\",IF(共通条件・結果!AA7=\"７地域\",0.49,IF(共通条件・結果!AA7=\"６地域\",0.498,IF(共通条件・結果!AA7=\"５地域\",0.5,IF(共通条件・結果!AA7=\"４地域\",0.508,IF(共通条件・結果!AA7=\"３地域\",0.487,IF(共通条件・結果!AA7=\"２地域\",0.527,IF(共通条件・結果!AA7=\"１地域\",0.56))))))))","v":0.487},{"$f":"IF(共通条件・結果!AA7=\"８地域\",\"-\",IF(共通条件・結果!AA7=\"７地域\",0.843,IF(共通条件・結果!AA7=\"６地域\",0.833,IF(共通条件・結果!AA7=\"５地域\",0.846,IF(共通条件・結果!AA7=\"４地域\",0.724,IF(共通条件・結果!AA7=\"３地域\",0.751,IF(共通条件・結果!AA7=\"２地域\",0.766,IF(共通条件・結果!AA7=\"１地域\",0.823))))))))","v":0.751},null,"壁（北東）",{"v":0.43,"d":"0.430"},0.412,{"v":0.39,"d":"0.390"},0.426,0.437,0.431,0.415,0.414]
[{"$nulls":15},{"$f":"IF(OR($B$7=\"\",F11=\"\"),\"\",IF(OR(D11=\"屋根\",D11=\"天井\"),1,IF(OR(D11=\"ピット等\",D11=\"その他床\",D11=\"外気床\"),0,VLOOKUP($B$7,$AJ$7:$AL$14,2,0))))","v":""},null,{"$f":"IF(OR($B$7=\"\",F11=\"\"),\"\",IF(OR(D11=\"屋根\",D11=\"天井\"),1,IF(OR(D11=\"ピット等\",D11=\"その他床\",D11=\"外気床\"),0,VLOOKUP($B$7,$AJ$7:$AL$14,3,0))))","v":""},null,"",null,"-",null,"",{"$nulls":10},true,"南",{"$f":"IF(共通条件・結果!AA7=\"８地域\",\"0.480\",IF(共通条件・結果!AA7=\"７地域\",0.412,IF(共通条件・結果!AA7=\"６地域\",0.434,IF(共通条件・結果!AA7=\"５地域\",0.472,IF(共通条件・結果!AA7=\"４地域\",0.437,IF(共通条件・結果!AA7=\"３地域\",0.476,IF(共通条件・結果!AA7=\"２地域\",0.507,IF(共通条件・結果!AA7=\"１地域\",0.502))))))))","v":0.476},{"$f":"IF(共通条件・結果!AA7=\"８地域\",\"-\",IF(共通条件・結果!AA7=\"７地域\",1.023,IF(共通条件・結果!AA7=\"６地域\",0.936,IF(共通条件・結果!AA7=\"５地域\",0.983,IF(共通条件・結果!AA7=\"４地域\",0.815,IF(共通条件・結果!AA7=\"３地域\",0.851,IF(共通条件・結果!AA7=\"２地域\",0.856,IF(共通条件・結果!AA7=\"１地域\",0.935))))))))","v":0.851},null,"壁（東）",0.545,0.503,0.468,0.518,{"v":0.5,"d":"0.500"},0.512,0.509,0.515]
[{"$nulls":15},{"$f":"IF(OR($B$12=\"\",F12=\"\"),\"\",IF(OR(D12=\"屋根\",D12=\"天井\"),1,IF(OR(D12=\"ピット等\",D12=\"その他床\",D12=\"外気床\"),0,VLOOKUP($B$12,$AJ$7:$AL$14,2,0))))","v":""},null,{"$f":"IF(OR($B$12=\"\",F12=\"\"),\"\",IF(OR(D12=\"屋根\",D12=\"天井\"),1,IF(OR(D12=\"ピット等\",D12=\"その他床\",D12=\"外気床\"),0,VLOOKUP($B$12,$AJ$7:$AL$14,3,0))))","v":""},null,"",null,"-",null,"",{"$nulls":10},true,"南西",{"$f":"IF(共通条件・結果!AA7=\"８地域\",\"0.517\",IF(共通条件・結果!AA7=\"７地域\",0.479,IF(共通条件・結果!AA7=\"６地域\",0.491,IF(共通条件・結果!AA7=\"５地域\",0.52,IF(共通条件・結果!AA7=\"４地域\",0.481,IF(共通条件・結果!AA7=\"３地域\",0.55,IF(共通条件・結果!AA7=\"２地域\",0.548,IF(共通条件・結果!AA7=\"１地域\",0.526))))))))","v":{"v":0.55,"d":"0.550"}},{"$f":"IF(共通条件・結果!AA7=\"８地域\",\"-\",IF(共通条件・結果!AA7=\"７地域\",0.848,IF(共通条件・結果!AA7=\"６地域\",0.763,IF(共通条件・結果!AA7=\"５地域\",0.815,IF(共通条件・結果!AA7=\"４地域\",0.723,IF(共通条件・結果!AA7=\"３地域\",0.75,IF(共通条件・結果!AA7=\"２地域\",0.753,IF(共通条件・結果!AA7=\"１地域\",0.79))))))))","v":{"v":0.75,"d":"0.750"}},null,"壁（南東）",{"v":0.56,"d":"0.560"},0.527,0.487,0.508,{"v":0.5,"d":"0.500"},0.498,{"v":0.49,"d":"0.490"},0.528]
[{"$nulls":15},{"$f":"IF(OR($B$12=\"\",F13=\"\"),\"\",IF(OR(D13=\"屋根\",D13=\"天井\"),1,IF(OR(D13=\"ピット等\",D13=\"その他床\",D13=\"外気床\"),0,VLOOKUP($B$12,$AJ$7:$AL$14,2,0))))","v":""},null,{"$f":"IF(OR($B$12=\"\",F13=\"\"),\"\",IF(OR(D13=\"屋根\",D13=\"天井\"),1,IF(OR(D13=\"ピット等\",D13=\"その他床\",D13=\"外気床\"),0,VLOOKUP($B$12,$AJ$7:$AL$14,3,0))))","v":""},null,"",null,"-",null,"",{"$nulls":10},true,"西",{"$f":"IF(共通条件・結果!AA7=\"８地域\",\"0.505\",IF(共通条件・結果!AA7=\"７地域\",0.495,IF(共通条件・結果!AA7=\"６地域\",0.504,IF(共通条件・結果!AA7=\"５地域\",0.518,IF(共通条件・結果!AA7=\"４地域\",0.481,IF(共通条件・結果!AA7=\"３地域\",0.553,IF(共通条件・結果!AA7=\"２地域\",0.529,IF(共通条件・結果!AA7=\"１地域\",0.508))))))))","v":0.553},{"$f":"IF(共通条件・結果!AA7=\"８地域\",\"-\",IF(共通条件・結果!AA7=\"７地域\",0.548,IF(共通条件・結果!AA7=\"６地域\",0.523,IF(共通条件・結果!AA7=\"５地域\",0.538,IF(共通条件・結果!AA7=\"４地域\",0.527,IF(共通条件・結果!AA7=\"３地域\",0.542,IF(共通条件・結果!AA7=\"２地域\",0.544,IF(共通条件・結果!AA7=\"１地域\",0.535))))))))","v":0.542},null,"壁（南）",0.502,0.507,0.476,0.437,0.472,0.434,0.412,{"v":0.48,"d":"0.480"}]
[{"$nulls":15},{"$f":"IF(OR($B$12=\"\",F14=\"\"),\"\",IF(OR(D14=\"屋根\",D14=\"天井\"),1,IF(OR(D14=\"ピット等\",D14=\"その他床\",D14=\"外気床\"),0,VLOOKUP($B$12,$AJ$7:$AL$14,2,0))))","v":""},null,{"$f":"IF(OR($B$12=\"\",F14=\"\"),\"\",IF(OR(D14=\"屋根\",D14=\"天井\"),1,IF(OR(D14=\"ピット等\",D14=\"その他床\",D14=\"外気床\"),0,VLOOKUP($B$12,$AJ$7:$AL$14,3,0))))","v":""},null,"",null,"-",null,"",{"$nulls":10},true,"北西",{"$f":"IF(共通条件・結果!AA7=\"８地域\",\"0.411\",IF(共通条件・結果!AA7=\"７地域\",0.406,IF(共通条件・結果!AA7=\"６地域\",0.427,IF(共通条件・結果!AA7=\"５地域\",0.442,IF(共通条件・結果!AA7=\"４地域\",0.401,IF(共通条件・結果!AA7=\"３地域\",0.447,IF(共通条件・結果!AA7=\"２地域\",0.428,IF(共通条件・結果!AA7=\"１地域\",0.411))))))))","v":0.447},{"$f":"IF(共通条件・結果!AA7=\"８地域\",\"-\",IF(共通条件・結果!AA7=\"７地域\",0.284,IF(共通条件・結果!AA7=\"６地域\",0.317,IF(共通条件・結果!AA7=\"５地域\",0.297,IF(共通条件・結果!AA7=\"４地域\",0.326,IF(共通条件・結果!AA7=\"３地域\",0.351,IF(共通条件・結果!AA7=\"２地域\",0.341,IF(共通条件・結果!AA7=\"１地域\",0.325))))))))","v":0.351},null,"壁（南西）",0.526,0.548,{"v":0.55,"d":"0.550"},0.481,{"v":0.52,"d":"0.520"},0.491,0.479,0.517]
[{"$nulls":15},{"$f":"IF(OR($B$12=\"\",F15=\"\"),\"\",IF(OR(D15=\"屋根\",D15=\"天井\"),1,IF(OR(D15=\"ピット等\",D15=\"その他床\",D15=\"外気床\"),0,VLOOKUP($B$12,$AJ$7:$AL$14,2,0))))","v":""},null,{"$f":"IF(OR($B$12=\"\",F15=\"\"),\"\",IF(OR(D15=\"屋根\",D15=\"天井\"),1,IF(OR(D15=\"ピット等\",D15=\"その他床\",D15=\"外気床\"),0,VLOOKUP($B$12,$AJ$7:$AL$14,3,0))))","v":""},null,"",null,"-",null,"",{"$nulls":10},true,{"$nulls":4},"壁（西）",0.508,0.529,0.553,0.481,0.518,0.504,0.495,0.505]
[{"$nulls":15},{"$f":"IF(OR($B$12=\"\",F16=\"\"),\"\",IF(OR(D16=\"屋根\",D16=\"天井\"),1,IF(OR(D16=\"ピット等\",D16=\"その他床\",D16=\"外気床\"),0,VLOOKUP($B$12,$AJ$7:$AL$14,2,0))))","v":""},null,{"$f":"IF(OR($B$12=\"\",F16=\"\"),\"\",IF(OR(D16=\"屋根\",D16=\"天井\"),1,IF(OR(D16=\"ピット等\",D16=\"その他床\",D16=\"外気床\"),0,VLOOKUP($B$12,$AJ$7:$AL$14,3,0))))","v":""},null,"",null,"-",null,"",{"$nulls":10},true,{"$nulls":4},"壁（北西）",0.411,0.428,0.447,0.401,0.442,0.427,0.406,0.411]
[{"$nulls":15},{"$f":"IF(OR($B$17=\"\",F17=\"\"),\"\",IF(OR(D17=\"屋根\",D17=\"天井\"),1,IF(OR(D17=\"ピット等\",D17=\"その他床\",D17=\"外気床\"),0,VLOOKUP($B$17,$AJ$7:$AL$14,2,0))))","v":""},null,{"$f":"IF(OR($B$17=\"\",F17=\"\"),\"\",IF(OR(D17=\"屋根\",D17=\"天井\"),1,IF(OR(D17=\"ピット等\",D17=\"その他床\",D17=\"外気床\"),0,VLOOKUP($B$17,$AJ$7:$AL$14,3,0))))","v":""},null,"",null,"-",null,"",{"$nulls":10},true,{"$nulls":4},"ピット等",{"v":0,"d":"0.00"}]
[{"$nulls":15},{"$f":"IF(OR($B$17=\"\",F18=\"\"),\"\",IF(OR(D18=\"屋根\",D18=\"天井\"),1,IF(OR(D18=\"ピット等\",D18=\"その他床\",D18=\"外気床\"),0,VLOOKUP($B$17,$AJ$7:$AL$14,2,0))))","v":""},null,{"$f":"IF(OR($B$17=\"\",F18=\"\"),\"\",IF(OR(D18=\"屋根\",D18=\"天井\"),1,IF(OR(D18=\"ピット等\",D18=\"その他床\",D18=\"外気床\"),0,VLOOKUP($B$17,$AJ$7:$AL$14,3,0))))","v":""},null,"",null,"-",null,"",{"$nulls":10},true,{"$nulls":4},"その他床"]
[{"$nulls":15},{"$f":"IF(OR($B$17=\"\",F19=\"\"),\"\",IF(OR(D19=\"屋根\",D19=\"天井\"),1,IF(OR(D19=\"ピット等\",D19=\"その他床\",D19=\"外気床\"),0,VLOOKUP($B$17,$AJ$7:$AL$14,2,0))))","v":""},null,{"$f":"IF(OR($B$17=\"\",F19=\"\"),\"\",IF(OR(D19=\"屋根\",D19=\"天井\"),1,IF(OR(D19=\"ピット等\",D19=\"その他床\",D19=\"外気床\"),0,VLOOKUP($B$17,$AJ$7:$AL$14,3,0))))","v":""},null,"",null,"-",null,"",{"$nulls":10},true,{"$nulls":4},"外気床"]
[{"$nulls":15},{"$f":"IF(OR($B$17=\"\",F20=\"\"),\"\",IF(OR(D20=\"屋根\",D20=\"天井\"),1,IF(OR(D20=\"ピット等\",D20=\"その他床\",D20=\"外気床\"),0,VLOOKUP($B$17,$AJ$7:$AL$14,2,0))))","v":""},null,{"$f":"IF(OR($B$17=\"\",F20=\"\"),\"\",IF(OR(D20=\"屋根\",D20=\"天井\"),1,IF(OR(D20=\"ピット等\",D20=\"その他床\",D20=\"外気床\"),0,VLOOKUP($B$17,$AJ$7:$AL$14,3,0))))","v":""},null,"",null,"-",null,"",{"$nulls":10},true]
[{"$nulls":15},{"$f":"IF(OR($B$17=\"\",F21=\"\"),\"\",IF(OR(D21=\"屋根\",D21=\"天井\"),1,IF(OR(D21=\"ピット等\",D21=\"その他床\",D21=\"外気床\"),0,VLOOKUP($B$17,$AJ$7:$AL$14,2,0))))","v":""},null,{"$f":"IF(OR($B$17=\"\",F21=\"\"),\"\",IF(OR(D21=\"屋根\",D21=\"天井\"),1,IF(OR(D21=\"ピット等\",D21=\"その他床\",D21=\"外気床\"),0,VLOOKUP($B$17,$AJ$7:$AL$14,3,0))))","v":""},null,"",null,"-",null,"",{"$nulls":10},true]
[{"$nulls":15},{"$f":"IF(OR($B$22=\"\",F22=\"\"),\"\",IF(OR(D22=\"屋根\",D22=\"天井\"),1,IF(OR(D22=\"ピット等\",D22=\"その他床\",D22=\"外気床\"),0,VLOOKUP($B$22,$AJ$7:$AL$14,2,0))))","v":""},null,{"$f":"IF(OR($B$22=\"\",F22=\"\"),\"\",IF(OR(D22=\"屋根\",D22=\"天井\"),1,IF(OR(D22=\"ピット等\",D22=\"その他床\",D22=\"外気床\"),0,VLOOKUP($B$22,$AJ$7:$AL$14,3,0))))","v":""},null,"",null,"-",null,"",{"$nulls":10},true,{"$nulls":4},"暖房期"]
[{"$nulls":15},{"$f":"IF(OR($B$22=\"\",F23=\"\"),\"\",IF(OR(D23=\"屋根\",D23=\"天井\"),1,IF(OR(D23=\"ピット等\",D23=\"その他床\",D23=\"外気床\"),0,VLOOKUP($B$22,$AJ$7:$AL$14,2,0))))","v":""},null,{"$f":"IF(OR($B$22=\"\",F23=\"\"),\"\",IF(OR(D23=\"屋根\",D23=\"天井\"),1,IF(OR(D23=\"ピット等\",D23=\"その他床\",D23=\"外気床\"),0,VLOOKUP($B$22,$AJ$7:$AL$14,3,0))))","v":""},null,"",null,"-",null,"",{"$nulls":10},true,{"$nulls":4},"方位","地域区分"]
[{"$nulls":15},{"$f":"IF(OR($B$22=\"\",F24=\"\"),\"\",IF(OR(D24=\"屋根\",D24=\"天井\"),1,IF(OR(D24=\"ピット等\",D24=\"その他床\",D24=\"外気床\"),0,VLOOKUP($B$22,$AJ$7:$AL$14,2,0))))","v":""},null,{"$f":"IF(OR($B$22=\"\",F24=\"\"),\"\",IF(OR(D24=\"屋根\",D24=\"天井\"),1,IF(OR(D24=\"ピット等\",D24=\"その他床\",D24=\"外気床\"),0,VLOOKUP($B$22,$AJ$7:$AL$14,3,0))))","v":""},null,"",null,"-",null,"",{"$nulls":10},true,{"$nulls":5},"１（Ⅰa）","２（Ⅰb）","３（Ⅱ）","４（Ⅲ）","５（Ⅳa）","６（Ⅳb）","７（Ⅴ）","８（Ⅵ）"]
[{"$nulls":15},{"$f":"IF(OR($B$22=\"\",F25=\"\"),\"\",IF(OR(D25=\"屋根\",D25=\"天井\"),1,IF(OR(D25=\"ピット等\",D25=\"その他床\",D25=\"外気床\"),0,VLOOKUP($B$22,$AJ$7:$AL$14,2,0))))","v":""},null,{"$f":"IF(OR($B$22=\"\",F25=\"\"),\"\",IF(OR(D25=\"屋根\",D25=\"天井\"),1,IF(OR(D25=\"ピット等\",D25=\"その他床\",D25=\"外気床\"),0,VLOOKUP($B$22,$AJ$7:$AL$14,3,0))))","v":""},null,"",null,"-",null,"",{"$nulls":10},true,{"$nulls":4},"屋根",{"v":1,"d":"1.00"}]
[{"$nulls":15},{"$f":"IF(OR($B$22=\"\",F26=\"\"),\"\",IF(OR(D26=\"屋根\",D26=\"天井\"),1,IF(OR(D26=\"ピット等\",D26=\"その他床\",D26=\"外気床\"),0,VLOOKUP($B$22,$AJ$7:$AL$14,2,0))))","v":""},null,{"$f":"IF(OR($B$22=\"\",F26=\"\"),\"\",IF(OR(D26=\"屋根\",D26=\"天井\"),1,IF(OR(D26=\"ピット等\",D26=\"その他床\",D26=\"外気床\"),0,VLOOKUP($B$22,$AJ$7:$AL$14,3,0))))","v":""},null,"",null,"-",null,"",{"$nulls":10},true,{"$nulls":4},"天井"]
[{"$nulls":15},{"$f":"IF(OR($B$27=\"\",F27=\"\"),\"\",IF(OR(D27=\"屋根\",D27=\"天井\"),1,IF(OR(D27=\"ピット等\",D27=\"その他床\",D27=\"外気床\"),0,VLOOKUP($B$27,$AJ$7:$AL$14,2,0))))","v":""},null,{"$f":"IF(OR($B$27=\"\",F27=\"\"),\"\",IF(OR(D27=\"屋根\",D27=\"天井\"),1,IF(OR(D27=\"ピット等\",D27=\"その他床\",D27=\"外気床\"),0,VLOOKUP($B$27,$AJ$7:$AL$14,3,0))))","v":""},null,"",null,"-",null,"",{"$nulls":10},true,{"$nulls":4},"壁（北）",{"v":0.26,"d":"0.260"},0.263,0.284,0.256,0.238,0.261,0.227,"-"]
[{"$nulls":15},{"$f":"IF(OR($B$27=\"\",F28=\"\"),\"\",IF(OR(D28=\"屋根\",D28=\"天井\"),1,IF(OR(D28=\"ピット等\",D28=\"その他床\",D28=\"外気床\"),0,VLOOKUP($B$27,$AJ$7:$AL$14,2,0))))","v":""},null,{"$f":"IF(OR($B$27=\"\",F28=\"\"),\"\",IF(OR(D28=\"屋根\",D28=\"天井\"),1,IF(OR(D28=\"ピット等\",D28=\"その他床\",D28=\"外気床\"),0,VLOOKUP($B$27,$AJ$7:$AL$14,3,0))))","v":""},null,"",null,"-",null,"",{"$nulls":10},true,{"$nulls":4},"壁（北東）",0.333,0.341,0.348,{"v":0.33,"d":"0.330"},{"v":0.31,"d":"0.310"},0.325,0.281,"-"]
[{"$nulls":15},{"$f":"IF(OR($B$27=\"\",F29=\"\"),\"\",IF(OR(D29=\"屋根\",D29=\"天井\"),1,IF(OR(D29=\"ピット等\",D29=\"その他床\",D29=\"外気床\"),0,VLOOKUP($B$27,$AJ$7:$AL$14,2,0))))","v":""},null,{"$f":"IF(OR($B$27=\"\",F29=\"\"),\"\",IF(OR(D29=\"屋根\",D29=\"天井\"),1,IF(OR(D29=\"ピット等\",D29=\"その他床\",D29=\"外気床\"),0,VLOOKUP($B$27,$AJ$7:$AL$14,3,0))))","v":""},null,"",null,"-",null,"",{"$nulls":10},true,{"$nulls":4},"壁（東）",0.564,0.554,{"v":0.54,"d":"0.540"},0.531,0.568,0.579,0.543,"-"]
[{"$nulls":15},{"$f":"IF(OR($B$27=\"\",F30=\"\"),\"\",IF(OR(D30=\"屋根\",D30=\"天井\"),1,IF(OR(D30=\"ピット等\",D30=\"その他床\",D30=\"外気床\"),0,VLOOKUP($B$27,$AJ$7:$AL$14,2,0))))","v":""},null,{"$f":"IF(OR($B$27=\"\",F30=\"\"),\"\",IF(OR(D30=\"屋根\",D30=\"天井\"),1,IF(OR(D30=\"ピット等\",D30=\"その他床\",D30=\"外気床\"),0,VLOOKUP($B$27,$AJ$7:$AL$14,3,0))))","v":""},null,"",null,"-",null,"",{"$nulls":10},true,{"$nulls":4},"壁（南東）",0.823,0.766,0.751,0.724,0.846,0.833,0.843,"-"]
[{"$nulls":15},{"$f":"IF(OR($B$27=\"\",F31=\"\"),\"\",IF(OR(D31=\"屋根\",D31=\"天井\"),1,IF(OR(D31=\"ピット等\",D31=\"その他床\",D31=\"外気床\"),0,VLOOKUP($B$27,$AJ$7:$AL$14,2,0))))","v":""},null,{"$f":"IF(OR($B$27=\"\",F31=\"\"),\"\",IF(OR(D31=\"屋根\",D31=\"天井\"),1,IF(OR(D31=\"ピット等\",D31=\"その他床\",D31=\"外気床\"),0,VLOOKUP($B$27,$AJ$7:$AL$14,3,0))))","v":""},null,"",null,"-",null,"",{"$nulls":10},true,{"$nulls":4},"壁（南）",0.935,0.856,0.851,0.815,0.983,0.936,1.023,"-"]
[{"$nulls":15},{"$f":"IF(OR($B$32=\"\",F32=\"\"),\"\",IF(OR(D32=\"屋根\",D32=\"天井\"),1,IF(OR(D32=\"ピット等\",D32=\"その他床\",D32=\"外気床\"),0,VLOOKUP($B$32,$AJ$7:$AL$14,2,0))))","v":""},null,{"$f":"IF(OR($B$32=\"\",F32=\"\"),\"\",IF(OR(D32=\"屋根\",D32=\"天井\"),1,IF(OR(D32=\"ピット等\",D32=\"その他床\",D32=\"外気床\"),0,VLOOKUP($B$32,$AJ$7:$AL$14,3,0))))","v":""},null,"",null,"-",null,"",{"$nulls":10},true,{"$nulls":4},"壁（南西）",{"v":0.79,"d":"0.790"},0.753,{"v":0.75,"d":"0.750"},0.723,0.815,0.763,0.848,"-"]
[{"$nulls":15},{"$f":"IF(OR($B$32=\"\",F33=\"\"),\"\",IF(OR(D33=\"屋根\",D33=\"天井\"),1,IF(OR(D33=\"ピット等\",D33=\"その他床\",D33=\"外気床\"),0,VLOOKUP($B$32,$AJ$7:$AL$14,2,0))))","v":""},null,{"$f":"IF(OR($B$32=\"\",F33=\"\"),\"\",IF(OR(D33=\"屋根\",D33=\"天井\"),1,IF(OR(D33=\"ピット等\",D33=\"その他床\",D33=\"外気床\"),0,VLOOKUP($B$32,$AJ$7:$AL$14,3,0))))","v":""},null,"",null,"-",null,"",{"$nulls":10},true,{"$nulls":4},"壁（西）",0.535,0.544,0.542,0.527,0.538,0.523,0.548,"-"]
[{"$nulls":15},{"$f":"IF(OR($B$32=\"\",F34=\"\"),\"\",IF(OR(D34=\"屋根\",D34=\"天井\"),1,IF(OR(D34=\"ピット等\",D34=\"その他床\",D34=\"外気床\"),0,VLOOKUP($B$32,$AJ$7:$AL$14,2,0))))","v":""},null,{"$f":"IF(OR($B$32=\"\",F34=\"\"),\"\",IF(OR(D34=\"屋根\",D34=\"天井\"),1,IF(OR(D34=\"ピット等\",D34=\"その他床\",D34=\"外気床\"),0,VLOOKUP($B$32,$AJ$7:$AL$14,3,0))))","v":""},null,"",null,"-",null,"",{"$nulls":10},true,{"$nulls":4},"壁（北西）",0.325,0.341,0.351,0.326,0.297,0.317,0.284,"-"]
[{"$nulls":15},{"$f":"IF(OR($B$32=\"\",F35=\"\"),\"\",IF(OR(D35=\"屋根\",D35=\"天井\"),1,IF(OR(D35=\"ピット等\",D35=\"その他床\",D35=\"外気床\"),0,VLOOKUP($B$32,$AJ$7:$AL$14,2,0))))","v":""},null,{"$f":"IF(OR($B$32=\"\",F35=\"\"),\"\",IF(OR(D35=\"屋根\",D35=\"天井\"),1,IF(OR(D35=\"ピット等\",D35=\"その他床\",D35=\"外気床\"),0,VLOOKUP($B$32,$AJ$7:$AL$14,3,0))))","v":""},null,"",null,"-",null,"",{"$nulls":10},true,{"$nulls":4},"ピット等",{"v":0,"d":"0.00"}]
[{"$nulls":15},{"$f":"IF(OR($B$32=\"\",F36=\"\"),\"\",IF(OR(D36=\"屋根\",D36=\"天井\"),1,IF(OR(D36=\"ピット等\",D36=\"その他床\",D36=\"外気床\"),0,VLOOKUP($B$32,$AJ$7:$AL$14,2,0))))","v":""},null,{"$f":"IF(OR($B$32=\"\",F36=\"\"),\"\",IF(OR(D36=\"屋根\",D36=\"天井\"),1,IF(OR(D36=\"ピット等\",D36=\"その他床\",D36=\"外気床\"),0,VLOOKUP($B$32,$AJ$7:$AL$14,3,0))))","v":""},null,"",null,"-",null,"",{"$nulls":10},true,{"$nulls":4},"その他床"]
[{"$nulls":39},"外気床"]
[null,"2）住宅 ＜構造熱橋部＞ 計算結果"]
[null,"熱橋部",null,"　冷房期総日射熱取得量",{"$nulls":24},{"$f":"SUM(T7:U36)","v":{"v":0,"d":"0.00"}},null,"[W/(W/㎡)]"]
[{"$nulls":3},"　暖房期総日射熱取得量",{"$nulls":24},{"$f":"IF(共通条件・結果!AA7=\"８地域\",\"-\",SUM(V7:W36))","v":{"v":0,"d":"0.00"}},null,"[W/(W/㎡)]"]
[{"$nulls":3},"　総熱損失",{"$nulls":24},{"$f":"SUM(X7:Y36)","v":{"v":0,"d":"0.00"}},null,"W/K"]
[]
[]
[{"$nulls":16},"北","北東","東","南東","南","南西","西","北西","水平"]
[{"$nulls":16},"壁（上階床）","壁（上階床）","壁（上階床）","壁（上階床）","壁（上階床）","壁（上階床）","壁（上階床）","壁（上階床）","屋根"]
[{"$nulls":16},"壁（下階床）","壁（下階床）","壁（下階床）","壁（下階床）","壁（下階床）","壁（下階床）","壁（下階床）","壁（下階床）","天井"]
[{"$nulls":16},"壁（戸境）","壁（戸境）","壁（戸境）","壁（戸境）","壁（戸境）","壁（戸境）","壁（戸境）","壁（戸境）","ピット等"]
[{"$nulls":16},"壁（間仕切）","壁（間仕切）","壁（間仕切）","壁（間仕切）","壁（間仕切）","壁（間仕切）","壁（間仕切）","壁（間仕切）","その他床"]
[{"$nulls":16},"壁（その他）","壁（その他）","壁（その他）","壁（その他）","壁（その他）","壁（その他）","壁（その他）","壁（その他）","外気床"]

{"sheet":"Ｃ（屋根・床等）","index":10,"n_rows":35,"n_cols":34,"rows_kept":35,"merged":[[1,1,1,23],[4,1,6,2],[4,3,5,8],[4,9,6,10],[4,11,6,12],[4,13,6,14],[4,15,6,16],[4,17,6,18],[4,19,6,20],[6,3,6,5],[6,6,6,8],[7,1,7,2],[7,3,7,5],[7,6,7,8],[7,9,7,10],[7,11,7,12],[7,13,7,14],[7,15,7,16],[7,17,7,18],[7,19,7,20],[8,1,8,2],[8,3,8,5],[8,6,8,8],[8,9,8,10],[8,11,8,12],[8,13,8,14],[8,15,8,16],[8,17,8,18],[8,19,8,20],[9,1,9,2],[9,3,9,5],[9,6,9,8],[9,9,9,10],[9,11,9,12],[9,13,9,14],[9,15,9,16],[9,17,9,18],[9,19,9,20],[10,1,10,2],[10,3,10,5],[10,6,10,8],[10,9,10,10],[10,11,10,12],[10,13,10,14],[10,15,10,16],[10,17,10,18],[10,19,10,20],[11,1,11,2],[11,3,11,5],[11,6,11,8],[11,9,11,10],[11,11,11,12],[11,13,11,14],[11,15,11,16],[11,17,11,18],[11,19,11,20],[12,1,12,14],[12,15,12,16],[12,17,12,18],[12,19,12,20],[15,1,17,2],[15,3,17,4],[15,5,17,6],[15,7,17,8],[15,9,17,10],[15,11,17,12],[15,13,17,14],[15,15,17,16],[15,17,17,18],[15,19,17,20],[18,1,18,2],[18,3,18,4],[18,5,18,6],[18,7,18,8],[18,9,18,10],[18,11,18,12],[18,13,18,14],[18,15,18,16],[18,17,18,18],[18,19,18,20],[19,1,19,2],[19,3,19,4],[19,5,19,6],[19,7,19,8],[19,9,19,10],[19,11,19,12],[19,13,19,14],[19,15,19,16],[19,17,19,18],[19,19,19,20],[20,1,20,2],[20,3,20,4],[20,5,20,6],[20,7,20,8],[20,9,20,10],[20,11,20,12],[20,13,20,14],[20,15,20,16],[20,17,20,18],[20,19,20,20],[21,1,21,2],[21,3,21,4],[21,5,21,6],[21,7,21,8],[21,9,21,10],[21,11,21,12],[21,13,21,14],[21,15,21,16],[21,17,21,18],[21,19,21,20],[22,1,22,2],[22,3,22,4],[22,5,22,6],[22,7,22,8],[22,9,22,10],[22,11,22,12],[22,13,22,14],[22,15,22,16],[22,17,22,18],[22,19,22,20],[23,1,23,2],[23,3,23,4],[23,5,23,6],[23,7,23,8],[23,9,23,10],[23,11,23,12],[23,13,23,14],[23,15,23,16],[23,17,23,18],[23,19,23,20],[24,1,24,2],[24,3,24,4],[24,5,24,6],[24,7,24,8],[24,9,24,10],[24,11,24,12],[24,13,24,14],[24,15,24,16],[24,17,24,18],[24,19,24,20],[25,1,25,2],[25,3,25,4],[25,5,25,6],[25,7,25,8],[25,9,25,10],[25,11,25,12],[25,13,25,14],[25,15,25,16],[25,17,25,18],[25,19,25,20],[26,1,26,14],[26,15,26,16],[26,17,26,18],[26,19,26,20],[31,1,34,2],[31,3,31,9],[31,11,31,12],[31,15,31,16],[31,18,31,19],[31,20,31,21],[32,3,32,9],[32,20,32,21],[32,22,32,23],[33,3,33,9],[33,20,33,21],[33,22,33,23],[34,3,34,9],[34,20,34,21]]}
[]
[null,"内訳計算シートＣ　　＜屋根・天井・床等＞ の外皮熱損失量と日射熱取得量",{"$nulls":31},"規約"]
[{"$nulls":33},{"$f":"共通条件・結果!AH3","v":1}]
[null,"1）天窓等の入力"]
[null,"窓番号",null,"寸法[ｍ]",{"$nulls":5},"熱貫流率\n[W/(㎡･K)]",null,"日射熱\n取得率\n※1",null,"付属部材\nの有無",null,"冷房期\n日射熱\n取得量\n[W/(W/㎡)]",null,"暖房期\n日射熱\n取得量\n[W/(W/㎡)]",null,"熱損失\n[W/K]",{"$nulls":5},"補正熱貫流率",null,null,"取得日射量補正係数"]
[]
[{"$nulls":3},"幅",null,null,"高さ",{"$nulls":18},"Ui","⊿R",null,"冷房期","暖房期"]
[{"$nulls":15},{"$f":"IF(D8=\"\",\"\",D8*G8*L8*0.93)","v":""},null,{"$f":"IF(D8=\"\",\"\",IF(共通条件・結果!$AA$7=\"８地域\",\"-\",D8*G8*L8*0.51))","v":""},null,{"$f":"IF(D8=\"\",\"\",D8*G8*Z8)","v":""},{"$nulls":5},{"$f":"IF(AA8=\"FALSE\",J8,0.5*J8+0.5*(1/((1/J8)+AA8)))","v":0},{"$f":"IF(D8=\"\",\"FALSE\",IF(N8=\"雨戸\",0.1,IF(N8=\"ｼｬｯﾀｰ\",0.1,IF(N8=\"障子\",0.18))))","v":"FALSE"},null,0.93,0.51]
[{"$nulls":15},{"$f":"IF(D9=\"\",\"\",D9*G9*L9*0.93)","v":""},null,{"$f":"IF(D9=\"\",\"\",IF(共通条件・結果!$AA$7=\"８地域\",\"-\",D9*G9*L9*0.51))","v":""},null,{"$f":"IF(D9=\"\",\"\",D9*G9*Z9)","v":""},{"$nulls":5},{"$f":"IF(AA9=\"FALSE\",J9,0.5*J9+0.5*(1/((1/J9)+AA9)))","v":0},{"$f":"IF(D9=\"\",\"FALSE\",IF(N9=\"雨戸\",0.1,IF(N9=\"ｼｬｯﾀｰ\",0.1,IF(N9=\"障子\",0.18))))","v":"FALSE"}]
[{"$nulls":15},{"$f":"IF(D10=\"\",\"\",D10*G10*L10*0.93)","v":""},null,{"$f":"IF(D10=\"\",\"\",IF(共通条件・結果!$AA$7=\"８地域\",\"-\",D10*G10*L10*0.51))","v":""},null,{"$f":"IF(D10=\"\",\"\",D10*G10*Z10)","v":""},{"$nulls":5},0,{"$f":"IF(D10=\"\",\"FALSE\",IF(N10=\"雨戸\",0.1,IF(N10=\"ｼｬｯﾀｰ\",0.1,IF(N10=\"障子\",0.18))))","v":"FALSE"}]
[{"$nulls":15},{"$f":"IF(D11=\"\",\"\",D11*G11*L11*0.93)","v":""},null,{"$f":"IF(D11=\"\",\"\",IF(共通条件・結果!$AA$7=\"８地域\",\"-\",D11*G11*L11*0.51))","v":""},null,{"$f":"IF(D11=\"\",\"\",D11*G11*Z11)","v":""},{"$nulls":5},0,{"$f":"IF(D11=\"\",\"FALSE\",IF(N11=\"雨戸\",0.1,IF(N11=\"ｼｬｯﾀｰ\",0.1,IF(N11=\"障子\",0.18))))","v":"FALSE"}]
[{"$nulls":15},"",null,{"$f":"IF(D12=\"\",\"\",IF(共通条件・結果!$AA$7=\"８地域\",\"-\",D12*G12*L12*0.51))","v":""},null,{"$f":"IF(D12=\"\",\"\",D12*G12*Z12)","v":""},{"$nulls":5},0,{"$f":"IF(D12=\"\",\"FALSE\",IF(N12=\"雨戸\",0.1,IF(N12=\"ｼｬｯﾀｰ\",0.1,IF(N12=\"障子\",0.18))))","v":"FALSE"}]
[null,"窓 ＜屋根・天井＞ 各値合計",{"$nulls":13},{"$f":"SUM(P8:Q12)","v":{"v":0,"d":"0.00"}},null,{"$f":"IF(共通条件・結果!AA7=\"８地域\",\"-\",SUM(R8:S12))","v":{"v":0,"d":"0.00"}},null,{"$f":"SUM(T8:U12)","v":{"v":0,"d":"0.00"}}]
[]
[null,"2）屋根・天井・外気等に接する床（以下「屋根等」という。）の入力"]
[null,"仕様番号",null,"部位\n名称",null,"屋根等\n面積\n[㎡]",null,"除外窓\n等面積\n[㎡]",null,"計算対象外皮面積\n[㎡]",null,"熱貫流率\n[W/(㎡･K)]",null,"温度差係数",null,"冷房期\n日射熱\n取得量\n[W/(W/㎡)]",null,"暖房期\n日射熱\n取得量\n[W/(W/㎡)]",null,"熱損失\n[W/K]"]
[]
[]
[{"$nulls":9},{"$f":"IF(F19=\"\",\"\",F19-H19)","v":""},{"$nulls":5},{"$f":"IF($D19=\"\",\"\",IF(OR($D19=\"外気床\",$D19=\"その他床\",$D19=\"上階界床\",$D19=\"下階界床\",$D19=\"ピット等\"),0,IF(OR($D19=\"屋根\",$D19=\"天井\"),J19*L19*0.034)))","v":""},null,{"$f":"IF(D19=\"\",\"\",IF(共通条件・結果!$AA$7=\"８地域\",\"-\",IF($D19=\"　\",\"\",IF(OR($D19=\"外気床\",$D19=\"その他床\",$D19=\"上階界床\",$D19=\"下階界床\",$D19=\"ピット等\"),0,IF(OR($D19=\"屋根\",$D19=\"天井\"),J19*L19*0.034)))))","v":""},null,{"$f":"IF(D19=\"\",\"\",J19*L19*N19)","v":""}]
[{"$nulls":9},{"$f":"IF(F20=\"\",\"\",F20-H20)","v":""},{"$nulls":5},{"$f":"IF($D20=\"\",\"\",IF(OR($D20=\"外気床\",$D20=\"その他床\",$D20=\"上階界床\",$D20=\"下階界床\",$D20=\"ピット等\"),0,IF(OR($D20=\"屋根\",$D20=\"天井\"),J20*L20*0.034)))","v":""},null,{"$f":"IF(D20=\"\",\"\",IF(共通条件・結果!$AA$7=\"８地域\",\"-\",IF($D20=\"　\",\"\",IF(OR($D20=\"外気床\",$D20=\"その他床\",$D20=\"上階界床\",$D20=\"下階界床\",$D20=\"ピット等\"),0,IF(OR($D20=\"屋根\",$D20=\"天井\"),J20*L20*0.034)))))","v":""},null,{"$f":"IF(D20=\"\",\"\",J20*L20*N20)","v":""}]
[{"$nulls":9},"",{"$nulls":5},{"$f":"IF($D21=\"\",\"\",IF(OR($D21=\"外気床\",$D21=\"その他床\",$D21=\"上階界床\",$D21=\"下階界床\",$D21=\"ピット等\"),0,IF(OR($D21=\"屋根\",$D21=\"天井\"),J21*L21*0.034)))","v":""},null,{"$f":"IF(D21=\"\",\"\",IF(共通条件・結果!$AA$7=\"８地域\",\"-\",IF($D21=\"　\",\"\",IF(OR($D21=\"外気床\",$D21=\"その他床\",$D21=\"上階界床\",$D21=\"下階界床\",$D21=\"ピット等\"),0,IF(OR($D21=\"屋根\",$D21=\"天井\"),J21*L21*0.034)))))","v":""},null,{"$f":"IF(D21=\"\",\"\",J21*L21*N21)","v":""}]
[{"$nulls":9},"",{"$nulls":5},"",null,{"$f":"IF(D22=\"\",\"\",IF(共通条件・結果!$AA$7=\"８地域\",\"-\",IF($D22=\"　\",\"\",IF(OR($D22=\"外気床\",$D22=\"その他床\",$D22=\"上階界床\",$D22=\"下階界床\",$D22=\"ピット等\"),0,IF(OR($D22=\"屋根\",$D22=\"天井\"),J22*L22*0.034)))))","v":""},null,""]
[{"$nulls":9},"",{"$nulls":5},"",null,{"$f":"IF(D23=\"\",\"\",IF(共通条件・結果!$AA$7=\"８地域\",\"-\",IF($D23=\"　\",\"\",IF(OR($D23=\"外気床\",$D23=\"その他床\",$D23=\"上階界床\",$D23=\"下階界床\",$D23=\"ピット等\"),0,IF(OR($D23=\"屋根\",$D23=\"天井\"),J23*L23*0.034)))))","v":""},null,""]
[{"$nulls":9},"",{"$nulls":5},"",null,{"$f":"IF(D24=\"\",\"\",IF(共通条件・結果!$AA$7=\"８地域\",\"-\",IF($D24=\"　\",\"\",IF(OR($D24=\"外気床\",$D24=\"その他床\",$D24=\"上階界床\",$D24=\"下階界床\",$D24=\"ピット等\"),0,IF(OR($D24=\"屋根\",$D24=\"天井\"),J24*L24*0.034)))))","v":""},null,""]
[{"$nulls":9},"",{"$nulls":5},"",null,{"$f":"IF(D25=\"\",\"\",IF(共通条件・結果!$AA$7=\"８地域\",\"-\",IF($D25=\"　\",\"\",IF(OR($D25=\"外気床\",$D25=\"その他床\",$D25=\"上階界床\",$D25=\"下階界床\",$D25=\"ピット等\"),0,IF(OR($D25=\"屋根\",$D25=\"天井\"),J25*L25*0.034)))))","v":""},null,""]
[{"$nulls":9},"",{"$nulls":5},"",null,{"$f":"IF(D26=\"\",\"\",IF(共通条件・結果!$AA$7=\"８地域\",\"-\",IF($D26=\"　\",\"\",IF(OR($D26=\"外気床\",$D26=\"その他床\",$D26=\"上階界床\",$D26=\"下階界床\",$D26=\"ピット等\"),0,IF(OR($D26=\"屋根\",$D26=\"天井\"),J26*L26*0.034)))))","v":""},null,""]
[null,"外壁 ＜屋根・天井・床＞ 各値合計",{"$nulls":13},{"$f":"SUM(P19:Q26)","v":{"v":0,"d":"0.00"}},null,{"$f":"IF(共通条件・結果!AA7=\"８地域\",\"-\",SUM(R19:S26))","v":{"v":0,"d":"0.00"}},null,{"$f":"SUM(T19:U26)","v":{"v":0,"d":"0.00"}}]
[]
[]
[]
[null,"3）住宅 ＜屋根・天井・床等＞ 計算結果"]
[null,"屋根等他",null,"　外皮等面積（内訳）",{"$nulls":7},{"$f":"P32+U32","v":{"v":0,"d":"0.00"}},null,"㎡（","天窓",{"$f":"D8*G8+D9*G9+D10*G10+D11*G11+D12*G12","v":0},null,"㎡、","屋根等",null,{"$f":"SUM(J19:K26)","v":0},null,"㎡）"]
[{"$nulls":3},"　冷房期総日射熱取得量",{"$nulls":16},{"$f":"P13+P27","v":{"v":0,"d":"0.00"}},null,"[W/(W/㎡)]"]
[{"$nulls":3},"　暖房期総日射熱取得量",{"$nulls":16},{"$f":"IF(共通条件・結果!AA7=\"８地域\",\"-\",R13+R27)","v":{"v":0,"d":"0.00"}},null,"[W/(W/㎡)]"]
[{"$nulls":3},"　総熱損失",{"$nulls":16},{"$f":"T13+T27","v":{"v":0,"d":"0.00"}},null,"W/K"]

{"sheet":"D（基礎）","index":11,"n_rows":45,"n_cols":42,"rows_kept":45,"merged":[[1,1,1,28],[2,10,2,13],[2,15,2,18],[4,1,5,2],[4,3,5,6],[4,7,5,8],[6,1,6,2],[6,3,6,6],[6,7,6,8],[7,1,7,2],[7,3,7,6],[7,7,7,8],[8,1,8,2],[8,3,8,6],[8,7,8,8],[9,1,9,2],[9,3,9,6],[9,7,9,8],[10,1,10,2],[10,3,10,6],[10,7,10,8],[11,1,11,2],[11,3,11,6],[11,7,11,8],[12,1,12,2],[12,3,12,6],[12,7,12,8],[13,1,13,2],[13,3,13,6],[13,7,13,8],[14,1,14,6],[14,7,14,8],[19,1,20,2],[19,3,20,6],[19,7,20,9],[19,10,20,12],[19,13,20,15],[19,16,20,18],[21,1,21,2],[21,3,21,6],[21,7,21,9],[21,10,21,12],[21,13,21,15],[21,16,21,18],[22,1,22,2],[22,3,22,6],[22,7,22,9],[22,10,22,12],[22,13,22,15],[22,16,22,18],[23,1,23,2],[23,3,23,6],[23,7,23,9],[23,10,23,12],[23,13,23,15],[23,16,23,18],[24,1,24,2],[24,3,24,6],[24,7,24,9],[24,10,24,12],[24,13,24,15],[24,16,24,18],[25,1,25,2],[25,3,25,6],[25,7,25,9],[25,10,25,12],[25,13,25,15],[25,16,25,18],[26,1,26,2],[26,3,26,6],[26,7,26,9],[26,10,26,12],[26,13,26,15],[26,16,26,18],[27,1,27,2],[27,3,27,6],[27,7,27,9],[27,10,27,12],[27,13,27,15],[27,16,27,18],[28,1,28,2],[28,3,28,6],[28,7,28,9],[28,10,28,12],[28,13,28,15],[28,16,28,18],[29,1,29,6],[29,7,29,9],[29,10,29,12],[29,13,29,15],[29,16,29,18],[32,1,33,3],[32,4,33,6],[32,7,33,9],[32,10,33,12],[32,13,33,15],[32,16,33,18],[32,19,33,21],[32,22,33,24],[32,35,32,36],[34,1,34,3],[34,4,34,6],[34,7,34,9],[34,10,34,12],[34,13,34,15],[34,16,34,18],[34,19,34,21],[34,22,34,24],[35,1,35,3],[35,4,35,6],[35,7,35,9],[35,10,35,12],[35,13,35,15],[35,16,35,18],[35,19,35,21],[35,22,35,24],[36,1,36,3],[36,4,36,6],[36,7,36,9],[36,10,36,12],[36,13,36,15],[36,16,36,18],[36,19,36,21],[36,22,36,24],[37,1,37,3],[37,4,37,6],[37,7,37,9],[37,10,37,12],[37,13,37,15],[37,16,37,18],[37,19,37,21],[37,22,37,24],[38,1,38,3],[38,4,38,6],[38,7,38,9],[38,10,38,12],[38,13,38,15],[38,16,38,18],[38,19,38,21],[38,22,38,24],[39,1,39,3],[39,4,39,6],[39,7,39,9],[39,10,39,12],[39,13,39,15],[39,16,39,18],[39,19,39,21],[39,22,39,24],[40,1,40,3],[40,4,40,6],[40,7,40,9],[40,10,40,12],[40,13,40,15],[40,16,40,18],[40,19,40,21],[40,22,40,24],[41,1,41,3],[41,4,41,6],[41,7,41,9],[41,10,41,12],[41,13,41,15],[41,16,41,18],[41,19,41,21],[41,22,41,24],[42,1,42,3],[42,4,42,6],[42,7,42,9],[42,10,42,12],[42,13,42,15],[42,16,42,18],[42,19,42,21],[42,22,42,24],[43,1,43,3],[43,4,43,6],[43,7,43,9],[43,10,43,12],[43,13,43,15],[43,16,43,18],[43,19,43,21],[43,22,43,24],[44,1,44,6],[44,7,44,9],[44,10,44,12],[44,13,44,15],[44,16,44,18],[44,19,44,21],[44,22,44,24]]}
[]
[null,"内訳計算シートD　　＜基礎壁、基礎等＞ の熱損失量（基礎断熱及び土間床等の部分）",{"$nulls":30},"新旧","規約"]
[null,"はじめにどちらかをご選択ください→",{"$nulls":8},"新計算法",{"$nulls":4},"旧計算法",{"$nulls":16},1,{"$f":"共通条件・結果!AH3","v":1}]
[null,"1）土間床等の面積の入力"]
[null,"部位番号",null,"部位名",{"$nulls":3},"面積\n[㎡]"]
{"$rows_empty":9}
[null,"土間床等面積合計",{"$nulls":5},{"$f":"SUM(H7:I14)","v":{"v":0,"d":"0.00"}}]
[null,"※3）において温度差係数を分けて計算する場合、上表は分けて入力して下さい。その際、面積は重複しないように片方のみを入力して下さい。"]
[]
[]
[null,"2）土間等の外周長さと線熱貫流率の入力"]
[null,"部位番号",null,"部位名",{"$nulls":3},"土間床等の外周長Ｌ［m］",null,null,"線熱貫流率\n[W/(m・K)]",null,null,"温度差係数",null,null,"熱損失\n[W/K]",{"$nulls":15},"温度差係数"]
[]
[null,{"$f":"IF(B7=\"\",\"\",B7)","v":""},null,{"$f":"IF(D7=\"\",\"\",D7)","v":""},{"$nulls":12},{"$f":"IF(H22=\"\",\"\",K22*H22*N22)","v":""},{"$nulls":15},{"v":1,"d":"1.00"}]
[null,{"$f":"IF(B8=\"\",\"\",B8)","v":""},null,{"$f":"IF(D8=\"\",\"\",D8)","v":""},{"$nulls":12},{"$f":"IF(H23=\"\",\"\",K23*H23*N23)","v":""},{"$nulls":15},{"v":0.7,"d":"0.70"}]
[null,{"$f":"IF(B9=\"\",\"\",B9)","v":""},null,{"$f":"IF(D9=\"\",\"\",D9)","v":""},{"$nulls":12},{"$f":"IF(H24=\"\",\"\",K24*H24*N24)","v":""},{"$nulls":15},0.15]
[null,{"$f":"IF(B10=\"\",\"\",B10)","v":""},null,{"$f":"IF(D10=\"\",\"\",D10)","v":""},{"$nulls":12},"",{"$nulls":15},0.05]
[null,{"$f":"IF(B11=\"\",\"\",B11)","v":""},null,{"$f":"IF(D11=\"\",\"\",D11)","v":""},{"$nulls":12},"",{"$nulls":15},0]
[null,{"$f":"IF(B12=\"\",\"\",B12)","v":""},null,{"$f":"IF(D12=\"\",\"\",D12)","v":""},{"$nulls":12},""]
[null,"",null,"",{"$nulls":12},""]
[null,"",null,"",{"$nulls":12},""]
[null,"土間等熱損失合計",{"$nulls":5},{"$f":"SUM(H22:J29)","v":{"v":0,"d":"0.00"}},null,null,"-",null,null,"-",null,null,{"$f":"SUM(Q22:S29)","v":{"v":0,"d":"0.00"}}]
[]
[null,"3）基礎壁の入力"]
[null,"仕様番号",null,null,"方位",null,null,"面積\n[㎡]",null,null,"熱貫流率\n[W/(㎡･K)]",null,null,"温度差係数",null,null,"冷房期日射熱取得量\n[W/(W/㎡)]",null,null,"暖房期日射熱取得量\n[W/(W/㎡)]",null,null,"熱損失\n[W/K]",{"$nulls":7},"方位",{"$nulls":4},"方位係数"]
[{"$nulls":35},"冷房期","暖房期",null,null,"夏",null,"冬"]
[{"$nulls":16},{"$f":"IF(H35=\"\",\"\",IF(AG35=\"外気側以外\",0,H35*K35*0.034*AJ35))","v":""},null,null,{"$f":"IF(H35=\"\",\"\",IF(AG35=\"外気側以外\",0,H35*K35*0.034*AK35))","v":""},null,null,{"$f":"IF(H35=\"\",\"\",K35*H35*N35)","v":""},{"$nulls":7},"南",null,{"$f":"IF(N35=1,\"外気側\",\"外気側以外\")","v":"外気側以外"},null,null,{"$f":"VLOOKUP(E35,夏方位係数,2,FALSE)","v":{"$error":"#N/A"}},{"$f":"VLOOKUP(E35,冬方位係数,2,FALSE)","v":{"$error":"#N/A"}},null,"南",{"$f":"'Ａ（南）'!$Z$4","v":0.476},"南",{"$f":"'Ａ（南）'!$AB$4","v":0.851}]
[{"$nulls":16},{"$f":"IF(H36=\"\",\"\",IF(AG36=\"外気側以外\",0,H36*K36*0.034*AJ36))","v":""},null,null,{"$f":"IF(H36=\"\",\"\",IF(AG36=\"外気側以外\",0,H36*K36*0.034*AK36))","v":""},null,null,{"$f":"IF(H36=\"\",\"\",K36*H36*N36)","v":""},{"$nulls":7},"東",null,{"$f":"IF(N36=1,\"外気側\",\"外気側以外\")","v":"外気側以外"},null,null,{"$f":"VLOOKUP(E36,夏方位係数,2,FALSE)","v":{"$error":"#N/A"}},{"$f":"VLOOKUP(E36,冬方位係数,2,FALSE)","v":{"$error":"#N/A"}},null,"東",{"$f":"'Ａ（東）'!$Z$4","v":0.468},"東",{"$f":"'Ａ（東）'!$AB$4","v":0.54}]
[{"$nulls":16},"",null,null,"",null,null,"",{"$nulls":7},"北",null,"外気側以外",null,null,{"$error":"#N/A"},{"$error":"#N/A"},null,"北",{"$f":"'Ａ（北）'!$Z$4","v":0.335},"北",{"$f":"'Ａ（北）'!$AB$4","v":0.284}]
[{"$nulls":16},"",null,null,"",null,null,"",{"$nulls":7},"西",null,"外気側以外",null,null,{"$error":"#N/A"},{"$error":"#N/A"},null,"西",{"$f":"'Ａ（西）'!$Z$4","v":0.553},"西",{"$f":"'Ａ（西）'!$AB$4","v":0.542}]
[{"$nulls":16},"",null,null,"",null,null,"",{"$nulls":7},"南東",null,"外気側以外",null,null,{"$error":"#N/A"},{"$error":"#N/A"},null,"南東",{"$f":"'Ａ（南東）'!$Z$4","v":0.487},"南東",{"$f":"'Ａ（南東）'!$AB$4","v":0.751}]
[{"$nulls":16},"",null,null,"",null,null,"",{"$nulls":7},"北東",null,"外気側以外",null,null,{"$error":"#N/A"},{"$error":"#N/A"},null,"北東",{"$f":"'Ａ（北東）'!$Z$4","v":0.39},"北東",{"$f":"'Ａ（北東）'!$AB$4","v":0.348}]
[{"$nulls":16},"",null,null,"",null,null,"",{"$nulls":7},"北西",null,"外気側以外",null,null,{"$error":"#N/A"},{"$error":"#N/A"},null,"北西",{"$f":"'Ａ（北西）'!$Z$4","v":0.447},"北西",{"$f":"'Ａ（北西）'!$AB$4","v":0.351}]
[{"$nulls":16},"",null,null,"",null,null,"",{"$nulls":7},"南西",null,"外気側以外",null,null,{"$error":"#N/A"},{"$error":"#N/A"},null,"南西",{"$f":"'Ａ（南西）'!$Z$4","v":0.55},"南西",{"$f":"'Ａ（南西）'!$AB$4","v":0.75}]
[{"$nulls":16},"",null,null,"",null,null,"",{"$nulls":9},"外気側以外",null,null,{"$error":"#N/A"},{"$error":"#N/A"}]
[{"$nulls":16},"",null,null,"",null,null,"",{"$nulls":9},"外気側以外",null,null,{"$error":"#N/A"},{"$error":"#N/A"}]
[null,"基礎壁合計",{"$nulls":5},{"$f":"SUM(H35:J44)","v":{"v":0,"d":"0.00"}},null,null,"-",null,null,"-",null,null,{"$f":"SUM(Q35:S44)","v":{"v":0,"d":"0.00"}},null,null,{"$f":"IF(共通条件・結果!AA7=\"８地域\",\"-\",SUM(T35:V44))","v":{"v":0,"d":"0.00"}},null,null,{"$f":"SUM(W35:Y44)","v":{"v":0,"d":"0.00"}}]

{"sheet":"【付録】","index":12,"n_rows":15,"n_cols":36,"rows_kept":15,"merged":[[0,0,0,28],[1,0,1,28],[3,0,4,1],[3,2,4,5],[3,6,4,7],[3,8,4,9],[3,10,4,11],[3,12,4,13],[3,14,4,15],[3,16,4,17],[3,18,4,19],[3,20,4,21],[3,22,4,23],[3,24,4,25],[3,26,4,28],[3,31,3,35],[5,0,5,1],[5,2,5,5],[5,6,5,7],[5,8,5,9],[5,10,5,11],[5,12,5,13],[5,14,5,15],[5,16,5,17],[5,18,5,19],[5,20,5,21],[5,22,5,23],[5,24,5,25],[5,26,5,28],[6,0,6,1],[6,2,6,5],[6,6,6,7],[6,8,6,9],[6,10,6,11],[6,12,6,13],[6,14,6,15],[6,16,6,17],[6,18,6,19],[6,20,6,21],[6,22,6,23],[6,24,6,25],[6,26,6,28],[7,0,7,1],[7,2,7,5],[7,6,7,7],[7,8,7,9],[7,10,7,11],[7,12,7,13],[7,14,7,15],[7,16,7,17],[7,18,7,19],[7,20,7,21],[7,22,7,23],[7,24,7,25],[7,26,7,28],[8,0,8,1],[8,2,8,5],[8,6,8,7],[8,8,8,9],[8,10,8,11],[8,12,8,13],[8,14,8,15],[8,16,8,17],[8,18,8,19],[8,20,8,21],[8,22,8,23],[8,24,8,25],[8,26,8,28],[9,0,9,1],[9,2,9,5],[9,6,9,7],[9,8,9,9],[9,10,9,11],[9,12,9,13],[9,14,9,15],[9,16,9,17],[9,18,9,19],[9,20,9,21],[9,22,9,23],[9,24,9,25],[9,26,9,28],[10,0,10,1],[10,2,10,5],[10,6,10,7],[10,8,10,9],[10,10,10,11],[10,12,10,13],[10,14,10,15],[10,16,10,17],[10,18,10,19],[10,20,10,21],[10,22,10,23],[10,24,10,25],[10,26,10,28],[11,0,11,1],[11,2,11,5],[11,6,11,7],[11,8,11,9],[11,10,11,11],[11,12,11,13],[11,14,11,15],[11,16,11,17],[11,18,11,19],[11,20,11,21],[11,22,11,23],[11,24,11,25],[11,26,11,28],[12,0,12,1],[12,2,12,5],[12,6,12,7],[12,8,12,9],[12,10,12,11],[12,12,12,13],[12,14,12,15],[12,16,12,17],[12,18,12,19],[12,20,12,21],[12,22,12,23],[12,24,12,25],[12,26,12,28]]}
["【付録】"]
["このシートは、内訳計算シートDにて旧計算法を選択した場合に、２）の線熱貫流率へ入力する値を計算する為のシートです。\n算出された線熱貫流率は、内訳計算シートDに転記をしてください。",{"$nulls":32},"規約"]
[{"$nulls":33},{"$f":"共通条件・結果!AH3","v":1}]
["部位番号",null,"部位名",{"$nulls":3},"断熱材\n熱抵抗\nＲ１",null,"断熱材\n熱抵抗\nＲ２",null,"断熱材\n熱抵抗\nＲ３",null,"断熱材\n熱抵抗\nＲ４",null,"基礎高\n\nＨ１",null,"底盤高\n\nＨ２",null,"断熱材\n根入れ\nＷ１",null,"断熱材\n折返し\nＷ２",null,"断熱材\n折返し\nＷ３",null,"適　用\n計算式\n番　号",null,"線熱貫流率\n[W/(m・K)]"]
[{"$nulls":30},"H1≦0.4","（１）","W≦0.9","（３）","（３）１","（３）２"]
[{"$nulls":24},{"$f":"IF(Q6=\"\",\"\",IF(-1<=Q6,\"(1)\",IF(G6+M6>=3,\"(3)1\",\"(3)2\")))","v":""},null,{"$f":"IF(Q6=\"\",\"\",IF(IF(Y6=\"(1)\",AF6,AH6)<0.05,\"0.05\",IF(Y6=\"(1)\",AF6,AH6)))","v":""},{"$nulls":3},{"$f":"IF(O6>0.4,\"0.4\",O6)","v":0},{"$f":"1.8-1.36*(G6*(AE6+S6)+M6*(AE6-Q6))^0.15-0.01*(6.14-G6)*((I6+0.5*K6)*AG6)^0.5","v":1.8},{"$f":"IF(MAX(U6,W6)<=0.9,MAX(U6,W6),\"0.9\")","v":0},{"$f":"IF((G6+M6)>=3,AI6,AJ6)","v":1.8},{"$f":"1.8-1.47*(G6+M6)^0.08","v":1.8},{"$f":"1.8-1.36*(G6+M6)^0.15","v":1.8}]
[{"$nulls":24},{"$f":"IF(Q7=\"\",\"\",IF(-1<=Q7,\"(1)\",IF(G7+M7>=3,\"(3)1\",\"(3)2\")))","v":""},null,{"$f":"IF(Q7=\"\",\"\",IF(IF(Y7=\"(1)\",AF7,AH7)<0.05,\"0.05\",IF(Y7=\"(1)\",AF7,AH7)))","v":""},{"$nulls":3},{"$f":"IF(O7>0.4,\"0.4\",O7)","v":0},{"$f":"1.8-1.36*(G7*(AE7+S7)+M7*(AE7-Q7))^0.15-0.01*(6.14-G7)*((I7+0.5*K7)*AG7)^0.5","v":1.8},{"$f":"IF(MAX(U7,W7)<=0.9,MAX(U7,W7),\"0.9\")","v":0},{"$f":"IF((G7+M7)>=3,AI7,AJ7)","v":1.8},{"$f":"1.8-1.47*(G7+M7)^0.08","v":1.8},{"$f":"1.8-1.36*(G7+M7)^0.15","v":1.8}]
[{"$nulls":24},{"$f":"IF(Q8=\"\",\"\",IF(-1<=Q8,\"(1)\",IF(G8+M8>=3,\"(3)1\",\"(3)2\")))","v":""},null,"",{"$nulls":3},{"$f":"IF(O8>0.4,\"0.4\",O8)","v":0},{"$f":"1.8-1.36*(G8*(AE8+S8)+M8*(AE8-Q8))^0.15-0.01*(6.14-G8)*((I8+0.5*K8)*AG8)^0.5","v":1.8},{"$f":"IF(MAX(U8,W8)<=0.9,MAX(U8,W8),\"0.9\")","v":0},{"$f":"IF((G8+M8)>=3,AI8,AJ8)","v":1.8},{"$f":"1.8-1.47*(G8+M8)^0.08","v":1.8},{"$f":"1.8-1.36*(G8+M8)^0.15","v":1.8}]
[{"$nulls":24},"",null,"",{"$nulls":3},{"$f":"IF(O9>0.4,\"0.4\",O9)","v":0},{"$f":"1.8-1.36*(G9*(AE9+S9)+M9*(AE9-Q9))^0.15-0.01*(6.14-G9)*((I9+0.5*K9)*AG9)^0.5","v":1.8},{"$f":"IF(MAX(U9,W9)<=0.9,MAX(U9,W9),\"0.9\")","v":0},{"$f":"IF((G9+M9)>=3,AI9,AJ9)","v":1.8},{"$f":"1.8-1.47*(G9+M9)^0.08","v":1.8},{"$f":"1.8-1.36*(G9+M9)^0.15","v":1.8}]
[{"$nulls":24},"",null,"",{"$nulls":3},0,1.8,0,1.8,1.8,1.8]
[{"$nulls":24},"",null,"",{"$nulls":3},0,1.8,0,1.8,1.8,1.8]
[{"$nulls":24},"",null,"",{"$nulls":3},{"$f":"IF(O12>0.4,\"0.4\",O12)","v":0},{"$f":"1.8-1.36*(G12*(AE12+S12)+M12*(AE12-Q12))^0.15-0.01*(6.14-G12)*((I12+0.5*K12)*AG12)^0.5","v":1.8},{"$f":"IF(MAX(U12,W12)<=0.9,MAX(U12,W12),\"0.9\")","v":0},{"$f":"IF((G12+M12)>=3,AI12,AJ12)","v":1.8},{"$f":"1.8-1.47*(G12+M12)^0.08","v":1.8},{"$f":"1.8-1.36*(G12+M12)^0.15","v":1.8}]
[{"$nulls":24},"",null,"",{"$nulls":3},{"$f":"IF(O13>0.4,\"0.4\",O13)","v":0},{"$f":"1.8-1.36*(G13*(AE13+S13)+M13*(AE13-Q13))^0.15-0.01*(6.14-G13)*((I13+0.5*K13)*AG13)^0.5","v":1.8},{"$f":"IF(MAX(U13,W13)<=0.9,MAX(U13,W13),\"0.9\")","v":0},{"$f":"IF((G13+M13)>=3,AI13,AJ13)","v":1.8},{"$f":"1.8-1.47*(G13+M13)^0.08","v":1.8},{"$f":"1.8-1.36*(G13+M13)^0.15","v":1.8}]
["　注１：上記各部の寸法は下図の寸法等（長さｍ、熱抵抗㎡K/W）を入力して下さい。"]
["　注２：Ｈ１の寸法（基礎高さ）は0.4ｍを上限とし、0.4ｍを超える部分は内訳計算シートAまたはDで計算して下さい。"]

{"sheet":"外皮計算についてのQ&A","index":13,"n_rows":0,"n_cols":0,"rows_kept":0}

{"sheet":"日射熱取得の考え方","index":14,"n_rows":17,"n_cols":7,"rows_kept":17,"merged":[[3,1,3,11],[5,1,5,11],[7,3,8,8],[9,1,11,2],[9,3,11,5],[9,6,11,8],[12,1,13,2],[12,3,13,5],[12,6,13,8],[14,1,15,2],[14,3,15,5],[14,6,15,8]]}
[]
[null,"【中廊下等、直達光が当たらない場合の日射熱取得の考え方】"]
[]
[null,"中廊下の壁、界壁等（以下、中廊下等）における、直達光が当たらない場合の日射熱取得の考え方は次の通りとします。"]
[]
[null,"『直達光が当たらない場合は、日射熱取得は発生しない。』"]
[]
[{"$nulls":3},"中廊下等"]
[]
[{"$nulls":3},"直達光が当たる壁",null,null,"直達光が当たらない壁"]
[]
[]
[null,"日射熱取得の加算",null,"加算する",null,null,"加算しない"]
[]
[null,"熱損失の加算",null,"加算する",null,null,"加算する"]
[]
[null,"※住宅性能表示制度Ｑ&Ａ　整理番号5-030による"]

{"sheet":"熱橋の考え方 (H28年)","index":15,"n_rows":36,"n_cols":20,"rows_kept":36,"merged":[[19,17,20,17],[21,19,22,19],[23,19,24,19],[25,19,26,19],[27,19,28,19],[29,19,30,19],[31,19,32,19],[33,19,35,19]]}
[]
[null,"5-1 断熱等性能等級　ＲＣ造等の共同住宅における熱橋の考え方"]
[]
[null,"【熱橋算入ルール】"]
[]
[null,"　■STEP１：熱橋部位の確認"]
[null,"　　　・隣接する各住戸等※１が共有する熱橋部位の熱損失は各住戸等※１で按分する。"]
[null,"　■STEP２：温度差係数の設定"]
[null,"　　　・複数の隣接空間※２に属する熱橋部位の温度差係数は、最も温度差係数が大きい隣接空間※２の値を用いる（右図参照）。"]
[null,"　■STEP３：方位係数の設定"]
[null,"　　　①　最下階等、評価対象住戸の下階に住戸等※１がない場合、または、隣接する住戸等※１の下階に住戸等※１がない場合の床面に接する熱橋部位は下面の方位係数を用いる。"]
[null,"　　　②　最上階等、評価対象住戸の上階に住戸等※１がない場合、または、隣接する住戸等※１の上階に住戸等※１がない場合の屋根に接する熱橋部位は上面の方位係数を用いる。"]
[null,"　　　③　①・②に該当しない場合は横面（８方位）の方位係数を用いる。"]
[null,"　　　④　温度差係数1.0未満の熱橋部位または方位が下面とみなされる部位は方位係数を「0」とし、ηAC、ηAHは算入対象外とする。"]
[]
[null,"　　　※１　空調室（空調された共用部等）を含む。"]
[null,"　　　※２　評価対象住戸に隣接する外気等の空間。"]
[]
[]
[{"$nulls":17},"熱橋部位","熱橋種類","ηＡC、ηＡH値"]
[{"$nulls":18},"（温度差係数）","への加算"]
[{"$nulls":18},"上面","必要"]
[{"$nulls":18},"Hｉ=1.0"]
[{"$nulls":18},"上面","不要"]
[{"$nulls":18},"Hｉ=0.7"]
[{"$nulls":18},"横面（8方位）","必要"]
[{"$nulls":18},"Hｉ=1.0"]
[{"$nulls":18},"横面（8方位）","不要"]
[{"$nulls":18},"Hｉ=0.7"]
[{"$nulls":18},"下面（外気）","不要"]
[{"$nulls":18},"Hｉ=1.0"]
[{"$nulls":18},"下面（その他）","不要"]
[{"$nulls":18},"Hｉ=0.7"]
[{"$nulls":18},"下面（ピット・空調室）","不要"]
[{"$nulls":18},"Hｉ=0.05（1～3地域）"]
[{"$nulls":18},"Hｉ=0.15（4～9地域）"]

{"sheet":"更新履歴","index":16,"n_rows":23,"n_cols":6,"rows_kept":23,"merged":[[3,1,4,1],[3,2,4,2],[3,3,4,3],[3,4,4,4],[3,5,4,5],[5,1,8,1],[5,5,8,5],[9,1,11,1],[9,5,11,5],[13,1,14,1],[13,5,14,5],[16,1,22,1],[16,5,22,5]]}
[]
[null,"更新履歴"]
[null,"バージョン名","番号","更新箇所","更新内容","更新日"]
[null,"ver3.0\n(webプログラムver3.0対応)","1）","シートD（基礎壁、基礎等）","webプログラムver3.0対応へ変更","2021-04-12"]
[]
[null,"ver3.1","１）","シートA（方位別計算）","一部方位、冷房期取得日射熱補正係数に関する修正","2021-08-16"]
[null,null,"２）","シートA（方位別計算）","付属部材による補正熱貫流率に関する修正"]
[null,null,"３）","シートC（屋根・天井・床等）","天窓における付属部材による補正熱貫流率に関する修正"]
[null,null,"４）","シートC（屋根・天井・床等）","天窓の冷房期、暖房期取得日射熱補正係数に関する不具合の修正"]
[null,"Ver3.2","１）","シート共通条件・結果","等級5対応","2022-03-15"]
[null,null,"2）","シートD（基礎壁、基礎等）","新旧計算の選択、入力可能欄の追加対応、説明の追記"]
[null,null,"3）","シート【付録】","新規追加（旧基礎計算のための対応）"]
[null,"Ver3.3","１）","シートD（基礎壁、基礎等）","旧基礎計算時の基礎壁入力の適用","2022-04-11"]
[null,"Ver3.4","１）","シートA～D","温度差係数0の追加","2022-11-01"]
[null,null,"2）","シートA（方位別計算）","日射熱取得　加算の必要性チェックマスの不具合の修正"]
[null,"Ver3.5","１）","シート共通条件・結果","等級6・7対応","2023-03-17"]
[null,"Ver3.6","1）","共通条件・結果","入力責任者欄追加","2025-04-08"]
[null,null,"2）","共通条件・結果","省エネ基準明記"]
[null,null,"3）","共通条件・結果","平均熱貫流率小数点以下2位の0を表記"]
[null,null,"4）","シートA（方位別計算）、【付録】","基礎壁の入力箇所修正"]
[null,null,"5）","シートC（基礎）","旧計算法の廃止時期を明記"]
[null,null,"6）","シートC（屋根・天井・床等）","窓番号/仕様番号の書式修正"]
[null,null,"7）","外皮計算書についてのQ&A","シート名修正、内容修正"]